{"text_format":"1","workbook":"xlsx","n_sheets":15,"sheets":["Forside","Efterafgrøde beslutningsstøtte","Beslutningstræ","Karaktermatrice","Grundkarakterer","1. Anders","99. Andre efterafgrøder","Lister","Hjælpe beregning","Norm","Basis_norm","Norm lig basisnorm","Version","Afgrøder i regnearket","Anvendte kriterier"],"not_rendered":{"charts":0,"images":4,"macros":1,"external_links":0,"defined_names":18,"comments":2,"pivot_tables":0},"unopened":[],"bounds":{"document_bytes":16777216,"sheet_cells":100000,"rows_first":2000,"rows_last":500,"rows_between":2000,"halvings":0,"cell_chars":16384,"cell_head_chars":4096},"cells_cut":0,"cells_raw":0,"read":"whole","date_system":"1900"}

{"sheet":"Forside","index":0,"n_rows":24,"n_cols":1,"rows_kept":24,"cut":false,"hidden":false,"merged":[]}
[]
[]
["Efterafgrøde beslutnsingsstøtteværktøj"]
[]
["Beslutningsstøtteværktøjet er opdateret i ferbuar 2017. Blandt andet blev der rette en del fejl ang. lovlighed af forskellige afgrøder. "]
["Beslutningsstøtteværktøjet kan for nuværende ikke håndtere de frivlillige efterafgrøder med støtte som bliver en del af landbrugspakkens implementering fra 2017, idet det endelige regelsæt ikke kendes ved værktøjets færdiggørelse."]
[]
["Gå til arket \"Efterafgrøde beslutningsstøtte\" for at starte beregneren"]
[]
[]
[]
[]
[]
[]
["Udviklingen af dette værktøj er støttet af: "]
[]
[]
[]
[]
[]
[]
[]
[]
["Værktøjet er i 2015 udviklet i regi af GUDP OPTIplant, og er i 2016 opdateret med støtte fra promilleafgiftsfonden for landbrug "]

{"sheet":"Efterafgrøde beslutningsstøtte","index":1,"n_rows":62,"n_cols":16,"rows_kept":62,"cut":false,"hidden":false,"merged":[[10,2,15,3],[2,16,21,16],[2,17,21,17],[2,10,21,10],[2,11,21,11],[2,15,21,15],[2,4,21,4],[2,12,21,12],[2,13,21,13],[2,14,21,14],[2,5,21,5],[2,6,21,6],[2,7,21,7],[2,8,21,8],[2,9,21,9]]}
[{"$f":"Version!A1","v":"Version 1.06, 18. januar 2016"}]
["Beslutningsstøtteværktøj til valg af efterafgrøder"]
[null,null,null,null,{"$f":"Beslutningstræ!HA40","v":"Pris"},{"$f":"Beslutningstræ!HB40","v":"Nettoomkostninger"},{"$f":"Beslutningstræ!HC40","v":"Er afgrøden robust mod ukrudtsmidler?"},{"$f":"Beslutningstræ!HD40","v":"Der findes sorter, der ikke opformerer kålbrok"},{"$f":"Beslutningstræ!HE40","v":"Der findes sorter, der er sanerende for roecystenematoder"},{"$f":"Beslutningstræ!HF40","v":"Vinterfast"},{"$f":"Beslutningstræ!HG40","v":"Egen udsæd kan anvendes"},{"$f":"Beslutningstræ!HH40","v":"Hurtig og dyb rodvækst på lerjord"},{"$f":"Beslutningstræ!HI40","v":"Kvælstoffikserende"},{"$f":"Beslutningstræ!HJ40","v":"Stor kvælstof-eftervirkning"},{"$f":"Beslutningstræ!HK40","v":"Pligtig efterafgrøde"},{"$f":"Beslutningstræ!IH40","v":"Vejledning"}]
[]
["Obligatoriske spørgsmål"]
["Skal afgrøden kunne fungere som:"]
["Vælg funktion"]
[]
["Hvilken afgrøde skal efterafgrøden sås i?"]
["Vælg afgrøde"]
[null,null,{"$f":"IF('Norm lig basisnorm'!D57=FALSE,\"Bemærk at der anvendes egne priser og/eller merudbytter i beregningerne\",IF('Norm lig basisnorm'!D57,\"\",\"FEJL\"))","v":""}]
["Hvornår skal afgrøden etableres?"]
["Vælg etableringstidspunkt"]
[]
["Jordtype på arealet"]
["Vælg jordtype"]
[]
["Hvilken afgrøde skal sås efter efterafgrøden"]
["Vælg afgrøde"]
[{"$f":"IF(OR(A7=\"Vælg funktion\",A7=\"Frivillig efterafgrøde\"),\"\",\"Vær opmærksom på, at gældende love og regler angående pligtige efter- og mellemafgrøder og MFO afgrøder er komplicerede og ændres jævnligt. Du skal selv kontrollere, at de efterafgrøder, du sår, overholder gældende regler.\")","v":""}]
[]
["Udvælgelseskriterier.",null,null,{"$f":"Beslutningstræ!GZ80","v":"Efterafgrøde"}]
["Økonomi",null,null,"Ingen efterafgrøde opfylder de valgte kriterier",{"$f":"(Beslutningstræ!HA81)","v":""},{"$f":"(Beslutningstræ!HB81)","v":""},{"$f":"(Beslutningstræ!HC81)","v":""},{"$f":"(Beslutningstræ!HD81)","v":""},{"$f":"(Beslutningstræ!HE81)","v":""},{"$f":"(Beslutningstræ!HF81)","v":""},{"$f":"(Beslutningstræ!HG81)","v":""},{"$f":"(Beslutningstræ!HH81)","v":""},{"$f":"(Beslutningstræ!HI81)","v":""},{"$f":"(Beslutningstræ!HJ81)","v":""},{"$f":"(Beslutningstræ!HK81)","v":""},{"$f":"IF(E23=\"\",\"\",IF(A$7<>\"Pligtig mellemafgrøde\",HYPERLINK(\"https://dyrk-plant.dlbr.dk/Web/(S(ikevr3oqnx5oe2t5cyfyknyq))/forms/Main.aspx?page=Vejledning&cropID=226\",\"Efterafgrøder\"),HYPERLINK(\"https://dyrk-plant.dlbr.dk/Web/(S(0x3ftyiaahcpttq0ljebuany))/forms/Main.aspx?page=Vejledning&cropID=238\",\"Mellemafgrøder\")))","v":""}]
["Etableringsomkostninger (lav pris)","Ikke vigtigt",null,{"$f":"(Beslutningstræ!GZ82)","v":""},{"$f":"(Beslutningstræ!HA82)","v":""},{"$f":"(Beslutningstræ!HB82)","v":""},{"$f":"(Beslutningstræ!HC82)","v":""},{"$f":"(Beslutningstræ!HD82)","v":""},{"$f":"(Beslutningstræ!HE82)","v":""},{"$f":"(Beslutningstræ!HF82)","v":""},{"$f":"(Beslutningstræ!HG82)","v":""},{"$f":"(Beslutningstræ!HH82)","v":""},{"$f":"(Beslutningstræ!HI82)","v":""},{"$f":"(Beslutningstræ!HJ82)","v":""},{"$f":"(Beslutningstræ!HK82)","v":""},{"$f":"IF(E24=\"\",\"\",IF(A$7<>\"Pligtig mellemafgrøde\",HYPERLINK(\"https://dyrk-plant.dlbr.dk/Web/(S(ikevr3oqnx5oe2t5cyfyknyq))/forms/Main.aspx?page=Vejledning&cropID=226\",\"Efterafgrøder\"),HYPERLINK(\"https://dyrk-plant.dlbr.dk/Web/(S(0x3ftyiaahcpttq0ljebuany))/forms/Main.aspx?page=Vejledning&cropID=238\",\"Mellemafgrøder\")))","v":""}]
[null,null,null,{"$f":"(Beslutningstræ!GZ83)","v":""},{"$f":"(Beslutningstræ!HA83)","v":""},{"$f":"(Beslutningstræ!HB83)","v":""},{"$f":"(Beslutningstræ!HC83)","v":""},{"$f":"(Beslutningstræ!HD83)","v":""},{"$f":"(Beslutningstræ!HE83)","v":""},{"$f":"(Beslutningstræ!HF83)","v":""},{"$f":"(Beslutningstræ!HG83)","v":""},{"$f":"(Beslutningstræ!HH83)","v":""},{"$f":"(Beslutningstræ!HI83)","v":""},{"$f":"(Beslutningstræ!HJ83)","v":""},{"$f":"(Beslutningstræ!HK83)","v":""},""]
["Sædskiftesygdomme og ukrudtsmidler",null,null,{"$f":"(Beslutningstræ!GZ84)","v":""},{"$f":"(Beslutningstræ!HA84)","v":""},{"$f":"(Beslutningstræ!HB84)","v":""},{"$f":"(Beslutningstræ!HC84)","v":""},{"$f":"(Beslutningstræ!HD84)","v":""},{"$f":"(Beslutningstræ!HE84)","v":""},{"$f":"(Beslutningstræ!HF84)","v":""},{"$f":"(Beslutningstræ!HG84)","v":""},{"$f":"(Beslutningstræ!HH84)","v":""},{"$f":"(Beslutningstræ!HI84)","v":""},{"$f":"(Beslutningstræ!HJ84)","v":""},{"$f":"(Beslutningstræ!HK84)","v":""},""]
["Er afgrøden robust mod ukrudtsmidler?","Ikke vigtigt",null,{"$f":"(Beslutningstræ!GZ85)","v":""},{"$f":"(Beslutningstræ!HA85)","v":""},{"$f":"(Beslutningstræ!HB85)","v":""},{"$f":"(Beslutningstræ!HC85)","v":""},{"$f":"(Beslutningstræ!HD85)","v":""},{"$f":"(Beslutningstræ!HE85)","v":""},{"$f":"(Beslutningstræ!HF85)","v":""},{"$f":"(Beslutningstræ!HG85)","v":""},{"$f":"(Beslutningstræ!HH85)","v":""},{"$f":"(Beslutningstræ!HI85)","v":""},{"$f":"(Beslutningstræ!HJ85)","v":""},{"$f":"(Beslutningstræ!HK85)","v":""},""]
["Der findes sorter, der ikke opformerer kålbrok","Ikke vigtigt",null,{"$f":"(Beslutningstræ!GZ86)","v":""},{"$f":"(Beslutningstræ!HA86)","v":""},{"$f":"(Beslutningstræ!HB86)","v":""},{"$f":"(Beslutningstræ!HC86)","v":""},{"$f":"(Beslutningstræ!HD86)","v":""},{"$f":"(Beslutningstræ!HE86)","v":""},{"$f":"(Beslutningstræ!HF86)","v":""},{"$f":"(Beslutningstræ!HG86)","v":""},{"$f":"(Beslutningstræ!HH86)","v":""},{"$f":"(Beslutningstræ!HI86)","v":""},{"$f":"(Beslutningstræ!HJ86)","v":""},{"$f":"(Beslutningstræ!HK86)","v":""},""]
["Der findes sorter, der er sanerende for roecystenematoder","Ikke vigtigt",null,{"$f":"(Beslutningstræ!GZ87)","v":""},{"$f":"(Beslutningstræ!HA87)","v":""},{"$f":"(Beslutningstræ!HB87)","v":""},{"$f":"(Beslutningstræ!HC87)","v":""},{"$f":"(Beslutningstræ!HD87)","v":""},{"$f":"(Beslutningstræ!HE87)","v":""},{"$f":"(Beslutningstræ!HF87)","v":""},{"$f":"(Beslutningstræ!HG87)","v":""},{"$f":"(Beslutningstræ!HH87)","v":""},{"$f":"(Beslutningstræ!HI87)","v":""},{"$f":"(Beslutningstræ!HJ87)","v":""},{"$f":"(Beslutningstræ!HK87)","v":""},""]
[null,null,null,{"$f":"(Beslutningstræ!GZ88)","v":""},{"$f":"(Beslutningstræ!HA88)","v":""},{"$f":"(Beslutningstræ!HB88)","v":""},{"$f":"(Beslutningstræ!HC88)","v":""},{"$f":"(Beslutningstræ!HD88)","v":""},{"$f":"(Beslutningstræ!HE88)","v":""},{"$f":"(Beslutningstræ!HF88)","v":""},{"$f":"(Beslutningstræ!HG88)","v":""},{"$f":"(Beslutningstræ!HH88)","v":""},{"$f":"(Beslutningstræ!HI88)","v":""},{"$f":"(Beslutningstræ!HJ88)","v":""},{"$f":"(Beslutningstræ!HK88)","v":""},""]
["Vinterfasthed og rodvækst og udsæd ",null,null,{"$f":"(Beslutningstræ!GZ89)","v":""},{"$f":"(Beslutningstræ!HA89)","v":""},{"$f":"(Beslutningstræ!HB89)","v":""},{"$f":"(Beslutningstræ!HC89)","v":""},{"$f":"(Beslutningstræ!HD89)","v":""},{"$f":"(Beslutningstræ!HE89)","v":""},{"$f":"(Beslutningstræ!HF89)","v":""},{"$f":"(Beslutningstræ!HG89)","v":""},{"$f":"(Beslutningstræ!HH89)","v":""},{"$f":"(Beslutningstræ!HI89)","v":""},{"$f":"(Beslutningstræ!HJ89)","v":""},{"$f":"(Beslutningstræ!HK89)","v":""},""]
["Vinterfast","Ikke vigtigt",null,{"$f":"(Beslutningstræ!GZ90)","v":""},{"$f":"(Beslutningstræ!HA90)","v":""},{"$f":"(Beslutningstræ!HB90)","v":""},{"$f":"(Beslutningstræ!HC90)","v":""},{"$f":"(Beslutningstræ!HD90)","v":""},{"$f":"(Beslutningstræ!HE90)","v":""},{"$f":"(Beslutningstræ!HF90)","v":""},{"$f":"(Beslutningstræ!HG90)","v":""},{"$f":"(Beslutningstræ!HH90)","v":""},{"$f":"(Beslutningstræ!HI90)","v":""},{"$f":"(Beslutningstræ!HJ90)","v":""},{"$f":"(Beslutningstræ!HK90)","v":""},""]
["Egen udsæd kan anvendes","Ikke vigtigt",null,{"$f":"(Beslutningstræ!GZ91)","v":""},{"$f":"(Beslutningstræ!HA91)","v":""},{"$f":"(Beslutningstræ!HB91)","v":""},{"$f":"(Beslutningstræ!HC91)","v":""},{"$f":"(Beslutningstræ!HD91)","v":""},{"$f":"(Beslutningstræ!HE91)","v":""},{"$f":"(Beslutningstræ!HF91)","v":""},{"$f":"(Beslutningstræ!HG91)","v":""},{"$f":"(Beslutningstræ!HH91)","v":""},{"$f":"(Beslutningstræ!HI91)","v":""},{"$f":"(Beslutningstræ!HJ91)","v":""},{"$f":"(Beslutningstræ!HK91)","v":""},""]
["Hurtig og dyb rodvækst på lerjord","Ikke vigtigt",null,{"$f":"(Beslutningstræ!GZ92)","v":""},{"$f":"(Beslutningstræ!HA92)","v":""},{"$f":"(Beslutningstræ!HB92)","v":""},{"$f":"(Beslutningstræ!HC92)","v":""},{"$f":"(Beslutningstræ!HD92)","v":""},{"$f":"(Beslutningstræ!HE92)","v":""},{"$f":"(Beslutningstræ!HF92)","v":""},{"$f":"(Beslutningstræ!HG92)","v":""},{"$f":"(Beslutningstræ!HH92)","v":""},{"$f":"(Beslutningstræ!HI92)","v":""},{"$f":"(Beslutningstræ!HJ92)","v":""},{"$f":"(Beslutningstræ!HK92)","v":""},""]
[null,null,null,{"$f":"(Beslutningstræ!GZ93)","v":""},{"$f":"(Beslutningstræ!HA93)","v":""},{"$f":"(Beslutningstræ!HB93)","v":""},{"$f":"(Beslutningstræ!HC93)","v":""},{"$f":"(Beslutningstræ!HD93)","v":""},{"$f":"(Beslutningstræ!HE93)","v":""},{"$f":"(Beslutningstræ!HF93)","v":""},{"$f":"(Beslutningstræ!HG93)","v":""},{"$f":"(Beslutningstræ!HH93)","v":""},{"$f":"(Beslutningstræ!HI93)","v":""},{"$f":"(Beslutningstræ!HJ93)","v":""},{"$f":"(Beslutningstræ!HK93)","v":""},""]
["Egenskaber mht. kvælstof",null,null,{"$f":"(Beslutningstræ!GZ94)","v":""},{"$f":"(Beslutningstræ!HA94)","v":""},{"$f":"(Beslutningstræ!HB94)","v":""},{"$f":"(Beslutningstræ!HC94)","v":""},{"$f":"(Beslutningstræ!HD94)","v":""},{"$f":"(Beslutningstræ!HE94)","v":""},{"$f":"(Beslutningstræ!HF94)","v":""},{"$f":"(Beslutningstræ!HG94)","v":""},{"$f":"(Beslutningstræ!HH94)","v":""},{"$f":"(Beslutningstræ!HI94)","v":""},{"$f":"(Beslutningstræ!HJ94)","v":""},{"$f":"(Beslutningstræ!HK94)","v":""},""]
["Kvælstoffikserende","Ikke vigtigt",null,{"$f":"(Beslutningstræ!GZ95)","v":""},{"$f":"(Beslutningstræ!HA95)","v":""},{"$f":"(Beslutningstræ!HB95)","v":""},{"$f":"(Beslutningstræ!HC95)","v":""},{"$f":"(Beslutningstræ!HD95)","v":""},{"$f":"(Beslutningstræ!HE95)","v":""},{"$f":"(Beslutningstræ!HF95)","v":""},{"$f":"(Beslutningstræ!HG95)","v":""},{"$f":"(Beslutningstræ!HH95)","v":""},{"$f":"(Beslutningstræ!HI95)","v":""},{"$f":"(Beslutningstræ!HJ95)","v":""},{"$f":"(Beslutningstræ!HK95)","v":""},""]
["Stor kvælstof eftervirkning","Ikke vigtigt",null,{"$f":"(Beslutningstræ!GZ96)","v":""},{"$f":"(Beslutningstræ!HA96)","v":""},{"$f":"(Beslutningstræ!HB96)","v":""},{"$f":"(Beslutningstræ!HC96)","v":""},{"$f":"(Beslutningstræ!HD96)","v":""},{"$f":"(Beslutningstræ!HE96)","v":""},{"$f":"(Beslutningstræ!HF96)","v":""},{"$f":"(Beslutningstræ!HG96)","v":""},{"$f":"(Beslutningstræ!HH96)","v":""},{"$f":"(Beslutningstræ!HI96)","v":""},{"$f":"(Beslutningstræ!HJ96)","v":""},{"$f":"(Beslutningstræ!HK96)","v":""},""]
[null,null,null,{"$f":"(Beslutningstræ!GZ97)","v":""},{"$f":"(Beslutningstræ!HA97)","v":""},{"$f":"(Beslutningstræ!HB97)","v":""},{"$f":"(Beslutningstræ!HC97)","v":""},{"$f":"(Beslutningstræ!HD97)","v":""},{"$f":"(Beslutningstræ!HE97)","v":""},{"$f":"(Beslutningstræ!HF97)","v":""},{"$f":"(Beslutningstræ!HG97)","v":""},{"$f":"(Beslutningstræ!HH97)","v":""},{"$f":"(Beslutningstræ!HI97)","v":""},{"$f":"(Beslutningstræ!HJ97)","v":""},{"$f":"(Beslutningstræ!HK97)","v":""},""]
[null,null,null,{"$f":"(Beslutningstræ!GZ98)","v":""},{"$f":"(Beslutningstræ!HA98)","v":""},{"$f":"(Beslutningstræ!HB98)","v":""},{"$f":"(Beslutningstræ!HC98)","v":""},{"$f":"(Beslutningstræ!HD98)","v":""},{"$f":"(Beslutningstræ!HE98)","v":""},{"$f":"(Beslutningstræ!HF98)","v":""},{"$f":"(Beslutningstræ!HG98)","v":""},{"$f":"(Beslutningstræ!HH98)","v":""},{"$f":"(Beslutningstræ!HI98)","v":""},{"$f":"(Beslutningstræ!HJ98)","v":""},{"$f":"(Beslutningstræ!HK98)","v":""},""]
["SEGES P/S",null,null,{"$f":"(Beslutningstræ!GZ99)","v":""},{"$f":"(Beslutningstræ!HA99)","v":""},{"$f":"(Beslutningstræ!HB99)","v":""},{"$f":"(Beslutningstræ!HC99)","v":""},{"$f":"(Beslutningstræ!HD99)","v":""},{"$f":"(Beslutningstræ!HE99)","v":""},{"$f":"(Beslutningstræ!HF99)","v":""},{"$f":"(Beslutningstræ!HG99)","v":""},{"$f":"(Beslutningstræ!HH99)","v":""},{"$f":"(Beslutningstræ!HI99)","v":""},{"$f":"(Beslutningstræ!HJ99)","v":""},{"$f":"(Beslutningstræ!HK99)","v":""},""]
["Udviklet af: ",null,null,{"$f":"(Beslutningstræ!GZ100)","v":""},{"$f":"(Beslutningstræ!HA100)","v":""},{"$f":"(Beslutningstræ!HB100)","v":""},{"$f":"(Beslutningstræ!HC100)","v":""},{"$f":"(Beslutningstræ!HD100)","v":""},{"$f":"(Beslutningstræ!HE100)","v":""},{"$f":"(Beslutningstræ!HF100)","v":""},{"$f":"(Beslutningstræ!HG100)","v":""},{"$f":"(Beslutningstræ!HH100)","v":""},{"$f":"(Beslutningstræ!HI100)","v":""},{"$f":"(Beslutningstræ!HJ100)","v":""},{"$f":"(Beslutningstræ!HK100)","v":""},""]
["Kristoffer Piil",null,null,{"$f":"(Beslutningstræ!GZ101)","v":""},{"$f":"(Beslutningstræ!HA101)","v":""},{"$f":"(Beslutningstræ!HB101)","v":""},{"$f":"(Beslutningstræ!HC101)","v":""},{"$f":"(Beslutningstræ!HD101)","v":""},{"$f":"(Beslutningstræ!HE101)","v":""},{"$f":"(Beslutningstræ!HF101)","v":""},{"$f":"(Beslutningstræ!HG101)","v":""},{"$f":"(Beslutningstræ!HH101)","v":""},{"$f":"(Beslutningstræ!HI101)","v":""},{"$f":"(Beslutningstræ!HJ101)","v":""},{"$f":"(Beslutningstræ!HK101)","v":""},""]
["Hans S. Østergaard",null,null,null,null,null,null,null,null,null,null,null,null,null,null,""]
["Erik Maegaard",null,null,null,{"$f":"IF(Beslutningstræ!HA63=\"xx\",\"\",Beslutningstræ!HA63)","v":""},{"$f":"IF(Beslutningstræ!HB63=\"xx\",\"\",Beslutningstræ!HB63)","v":""},{"$f":"IF(Beslutningstræ!HC63=\"xx\",\"\",Beslutningstræ!HC63)","v":""},{"$f":"IF(Beslutningstræ!HD63=\"xx\",\"\",Beslutningstræ!HD63)","v":""},{"$f":"IF(Beslutningstræ!HE63=\"xx\",\"\",Beslutningstræ!HE63)","v":""},{"$f":"IF(Beslutningstræ!HF63=\"xx\",\"\",Beslutningstræ!HF63)","v":""},{"$f":"IF(Beslutningstræ!HG63=\"xx\",\"\",Beslutningstræ!HG63)","v":""},{"$f":"IF(Beslutningstræ!HH63=\"xx\",\"\",Beslutningstræ!HH63)","v":""},{"$f":"IF(Beslutningstræ!HI63=\"xx\",\"\",Beslutningstræ!HI63)","v":""},{"$f":"IF(Beslutningstræ!HJ63=\"xx\",\"\",Beslutningstræ!HJ63)","v":""},{"$f":"IF(Beslutningstræ!HK63=\"xx\",\"\",Beslutningstræ!HK63)","v":""},""]
[null,null,null,null,{"$f":"IF(Beslutningstræ!HA64=\"xx\",\"\",Beslutningstræ!HA64)","v":""},{"$f":"IF(Beslutningstræ!HB64=\"xx\",\"\",Beslutningstræ!HB64)","v":""},{"$f":"IF(Beslutningstræ!HC64=\"xx\",\"\",Beslutningstræ!HC64)","v":""},{"$f":"IF(Beslutningstræ!HD64=\"xx\",\"\",Beslutningstræ!HD64)","v":""},{"$f":"IF(Beslutningstræ!HE64=\"xx\",\"\",Beslutningstræ!HE64)","v":""},{"$f":"IF(Beslutningstræ!HF64=\"xx\",\"\",Beslutningstræ!HF64)","v":""},{"$f":"IF(Beslutningstræ!HG64=\"xx\",\"\",Beslutningstræ!HG64)","v":""},{"$f":"IF(Beslutningstræ!HH64=\"xx\",\"\",Beslutningstræ!HH64)","v":""},{"$f":"IF(Beslutningstræ!HI64=\"xx\",\"\",Beslutningstræ!HI64)","v":""},{"$f":"IF(Beslutningstræ!HJ64=\"xx\",\"\",Beslutningstræ!HJ64)","v":""},{"$f":"IF(Beslutningstræ!HK64=\"xx\",\"\",Beslutningstræ!HK64)","v":""},""]
[null,null,null,null,{"$f":"IF(Beslutningstræ!HA65=\"xx\",\"\",Beslutningstræ!HA65)","v":""},{"$f":"IF(Beslutningstræ!HB65=\"xx\",\"\",Beslutningstræ!HB65)","v":""},{"$f":"IF(Beslutningstræ!HC65=\"xx\",\"\",Beslutningstræ!HC65)","v":""},{"$f":"IF(Beslutningstræ!HD65=\"xx\",\"\",Beslutningstræ!HD65)","v":""},{"$f":"IF(Beslutningstræ!HE65=\"xx\",\"\",Beslutningstræ!HE65)","v":""},{"$f":"IF(Beslutningstræ!HF65=\"xx\",\"\",Beslutningstræ!HF65)","v":""},{"$f":"IF(Beslutningstræ!HG65=\"xx\",\"\",Beslutningstræ!HG65)","v":""},{"$f":"IF(Beslutningstræ!HH65=\"xx\",\"\",Beslutningstræ!HH65)","v":""},{"$f":"IF(Beslutningstræ!HI65=\"xx\",\"\",Beslutningstræ!HI65)","v":""},{"$f":"IF(Beslutningstræ!HJ65=\"xx\",\"\",Beslutningstræ!HJ65)","v":""},{"$f":"IF(Beslutningstræ!HK65=\"xx\",\"\",Beslutningstræ!HK65)","v":""},""]
["Udviklingen af dette værktøj er støttet af: ",null,null,null,{"$f":"IF(Beslutningstræ!HA66=\"xx\",\"\",Beslutningstræ!HA66)","v":""},{"$f":"IF(Beslutningstræ!HB66=\"xx\",\"\",Beslutningstræ!HB66)","v":""},{"$f":"IF(Beslutningstræ!HC66=\"xx\",\"\",Beslutningstræ!HC66)","v":""},{"$f":"IF(Beslutningstræ!HD66=\"xx\",\"\",Beslutningstræ!HD66)","v":""},{"$f":"IF(Beslutningstræ!HE66=\"xx\",\"\",Beslutningstræ!HE66)","v":""},{"$f":"IF(Beslutningstræ!HF66=\"xx\",\"\",Beslutningstræ!HF66)","v":""},{"$f":"IF(Beslutningstræ!HG66=\"xx\",\"\",Beslutningstræ!HG66)","v":""},{"$f":"IF(Beslutningstræ!HH66=\"xx\",\"\",Beslutningstræ!HH66)","v":""},{"$f":"IF(Beslutningstræ!HI66=\"xx\",\"\",Beslutningstræ!HI66)","v":""},{"$f":"IF(Beslutningstræ!HJ66=\"xx\",\"\",Beslutningstræ!HJ66)","v":""},{"$f":"IF(Beslutningstræ!HK66=\"xx\",\"\",Beslutningstræ!HK66)","v":""},""]
[null,null,null,null,{"$f":"IF(Beslutningstræ!HA67=\"xx\",\"\",Beslutningstræ!HA67)","v":""},{"$f":"IF(Beslutningstræ!HB67=\"xx\",\"\",Beslutningstræ!HB67)","v":""},{"$f":"IF(Beslutningstræ!HC67=\"xx\",\"\",Beslutningstræ!HC67)","v":""},{"$f":"IF(Beslutningstræ!HD67=\"xx\",\"\",Beslutningstræ!HD67)","v":""},{"$f":"IF(Beslutningstræ!HE67=\"xx\",\"\",Beslutningstræ!HE67)","v":""},{"$f":"IF(Beslutningstræ!HF67=\"xx\",\"\",Beslutningstræ!HF67)","v":""},{"$f":"IF(Beslutningstræ!HG67=\"xx\",\"\",Beslutningstræ!HG67)","v":""},{"$f":"IF(Beslutningstræ!HH67=\"xx\",\"\",Beslutningstræ!HH67)","v":""},{"$f":"IF(Beslutningstræ!HI67=\"xx\",\"\",Beslutningstræ!HI67)","v":""},{"$f":"IF(Beslutningstræ!HJ67=\"xx\",\"\",Beslutningstræ!HJ67)","v":""},{"$f":"IF(Beslutningstræ!HK67=\"xx\",\"\",Beslutningstræ!HK67)","v":""},""]
[null," ",null,null,{"$f":"IF(Beslutningstræ!HA68=\"xx\",\"\",Beslutningstræ!HA68)","v":""},{"$f":"IF(Beslutningstræ!HB68=\"xx\",\"\",Beslutningstræ!HB68)","v":""},{"$f":"IF(Beslutningstræ!HC68=\"xx\",\"\",Beslutningstræ!HC68)","v":""},{"$f":"IF(Beslutningstræ!HD68=\"xx\",\"\",Beslutningstræ!HD68)","v":""},{"$f":"IF(Beslutningstræ!HE68=\"xx\",\"\",Beslutningstræ!HE68)","v":""},{"$f":"IF(Beslutningstræ!HF68=\"xx\",\"\",Beslutningstræ!HF68)","v":""},{"$f":"IF(Beslutningstræ!HG68=\"xx\",\"\",Beslutningstræ!HG68)","v":""},{"$f":"IF(Beslutningstræ!HH68=\"xx\",\"\",Beslutningstræ!HH68)","v":""},{"$f":"IF(Beslutningstræ!HI68=\"xx\",\"\",Beslutningstræ!HI68)","v":""},{"$f":"IF(Beslutningstræ!HJ68=\"xx\",\"\",Beslutningstræ!HJ68)","v":""},{"$f":"IF(Beslutningstræ!HK68=\"xx\",\"\",Beslutningstræ!HK68)","v":""},""]
[null,null,null,null,{"$f":"IF(Beslutningstræ!HA69=\"xx\",\"\",Beslutningstræ!HA69)","v":""},{"$f":"IF(Beslutningstræ!HB69=\"xx\",\"\",Beslutningstræ!HB69)","v":""},{"$f":"IF(Beslutningstræ!HC69=\"xx\",\"\",Beslutningstræ!HC69)","v":""},{"$f":"IF(Beslutningstræ!HD69=\"xx\",\"\",Beslutningstræ!HD69)","v":""},{"$f":"IF(Beslutningstræ!HE69=\"xx\",\"\",Beslutningstræ!HE69)","v":""},{"$f":"IF(Beslutningstræ!HF69=\"xx\",\"\",Beslutningstræ!HF69)","v":""},{"$f":"IF(Beslutningstræ!HG69=\"xx\",\"\",Beslutningstræ!HG69)","v":""},{"$f":"IF(Beslutningstræ!HH69=\"xx\",\"\",Beslutningstræ!HH69)","v":""},{"$f":"IF(Beslutningstræ!HI69=\"xx\",\"\",Beslutningstræ!HI69)","v":""},{"$f":"IF(Beslutningstræ!HJ69=\"xx\",\"\",Beslutningstræ!HJ69)","v":""},{"$f":"IF(Beslutningstræ!HK69=\"xx\",\"\",Beslutningstræ!HK69)","v":""},""]
[null,null,null,null,null,null,null,null,null,null,null,null,null,null,null,""]
[null,null,null," ",null,null,null,null,null,null,null,null,null,null,null,""]
[null,null,null,null,null,null,null,null,null,null,null,null,null,null,null,""]
[null,null,null,null,null,null,null,null,null,null,null,null,null,null,null,""]
[null,null,null,null,null,null,null,null,null,null,null,null,null,null,null,""]
[null,null,null,null,null,null,null,null,null,null,null,null,null,null,null,""]
[null,null,null,null,null,null,null,null,null,null,null,null,null,null,null,""]
[null,null,null,null,null,null,null,null,null,null,null,null,null,null,null,""]
[]
[]
[null,null,null," "]

{"sheet":"Beslutningstræ","index":2,"n_rows":128,"n_cols":243,"rows_kept":128,"cut":false,"hidden":true,"merged":[[36,27,36,45]]}
[]
[null,null,null,null,null,null,null,null,null,null,null,null,null,null,null,null,null,null,null,null,null,null,null,null,null,null,null,null,null,null,null,null,null,null,null,null,null,null,null,null,null,null,null,null,null,null,null,null,null,null,null,null,null,null,null,null,null,null,null,null,null,null,null,null,null,null,null,null,null,null,null,null,null,null,null,null,null,null,null,null,null,null,null,null,null,null,null,null,null,null,null,null,null,null,null,null,null,null,null,null,null,null,null,null,null,null,null,null,null,null,null,null,null,null,null,null,null,null,null,null,null,null,null,null,null,null,null,null,null,null,null,null,null,null,null,null,null,null,null,null,null,null,null,null,null,null,null,null,null,null,null,null,null,null,null,null,null,null,null,null,null,null,null,null,null,null,null,null,null,null,null,null,null,null,null,null,null,null,null,null,null,null,null,null,null,null,null,null,null,null,null,null,null,null,null,null,null,null,null,null,null,null,null,null,"Afgrøde",null,"Rækkefølgevægtning",10]
[null,null,null,null,null,null,null,null,null,null,null,null,null,null,null,null,null,null,null,null,null,null,null,null,null,null,null,null,null,null,null,null,null,null,null,null,null,null,null,null,null,null,null,null,null,null,null,null,null,null,null,null,null,null,null,null,null,null,null,null,null,null,null,null,null,null,null,null,null,null,null,null,null,null,null,null,null,null,null,null,null,null,null,null,null,null,null,null,null,null,null,null,null,null,null,null,null,null,null,null,null,null,null,null,null,null,null,null,null,null,null,null,null,null,null,null,null,null,null,null,null,null,null,null,null,null,null,null,null,null,null,null,null,null,null,null,null,null,null,null,null,null,null,null,null,null,null,null,null,null,null,null,null,null,null,null,null,null,null,null,null,null,null,null,null,null,null,null,null,null,null,null,null,null,null,null,null,null,null,null,null,null,null,null,null,null,null,null,null,null,null,null,null,null,null,null,null,null,"1= no ties",null,null,5,null,null,"Tidspunkt",null,"Vægt af udsåningstidspunkt",3]
[null,null,"1. Vintersæd","1. Tidligt udlæg",null,null,null,null,null,null,null,null,null,null,null,null,null,null,null,null,null,null,null,null,null,null,null,null,null,null,null,null,null,null,null,null,null,null,null,null,null,null,null,null,null,null,null,null,null,null,null,null,null,null,null,null,null,null,null,null,null,null,null,null,null,null,null,null,null,null,null,null,null,null,null,null,null,null,null,null,null,null,null,null,null,null,null,null,null,null,null,null,null,null,null,null,null,null,null,null,null,null,null,null,null,null,null,null,null,null,null,null,null,null,null,null,null,null,null,null,null,null,null,null,null,null,null,null,null,null,null,null,null,null,null,null,null,null,null,null,null,null,null,null,null,null,null,null,null,null,null,null,null,null,null,null,null,null,null,null,null,null,null,null,null,null,null,null,null,null,null,null,null,null,null,null,null,null,null,null,null,null,null,null,null,null,null,null,null,null,null,null,null,null,null,"nr.","defa","sys","Check for ties","Break ties","plads","vægt"]
[null,null,"2. Vårsæd","2. Før høst",null,null,null,null,null,null,null,null,null,null,null,null,null,null,null,null,null,null,null,null,null,null,null,null,null,null,null,null,null,null,null,null,null,null,null,null,null,null,null,null,null,null,null,null,null,null,null,null,null,null,null,null,null,null,null,null,null,null,null,null,null,null,null,null,null,null,null,null,null,null,null,null,null,null,null,null,null,null,null,null,null,null,null,null,null,null,null,null,null,null,null,null,null,null,null,null,null,null,null,null,null,null,null,null,null,null,null,null,null,null,null,null,null,null,null,null,null,null,null,null,null,null,null,null,null,null,null,null,null,null,null,null,null,null,null,null,null,null,null,null,null,null,null,null,null,null,null,null,null,null,null,null,null,null,null,null,null,null,null,null,null,null,null,null,null,null,null,null,null,null,null,null,null,null,null,null,null,null,null,null,null,null,null,null,null,null,null,null,null,null,null,1,21,{"$f":"GZ5+GO5/10","v":2.1},{"$f":"COUNTIF(GP$5:GP$26,GP5)","v":1},{"$f":"IF(GQ5>1,GP5+GO5/1000,GP5)","v":2.1},{"$f":"_xlfn.RANK.EQ(GR5,$GR$5:$GR$37,0)","v":1},{"$f":"GP5^$GT$3","v":40.841010000000004},null,null,"Pris",{"$f":"'Efterafgrøde beslutningsstøtte'!B24","v":"Ikke vigtigt"},{"$f":"VLOOKUP(GX5,Standard_karakterer,2,FALSE)","v":0},{"$f":"GY5","v":0}]
[null,null,"3. Majs","3. Efter høst",null,null,null,null,null,null,null,null,null,null,null,null,null,null,null,null,null,null,null,null,null,null,null,null,null,null,null,null,null,null,null,null,null,null,null,null,null,null,null,null,null,null,null,null,null,null,"Middelværdier",null,null,null,null,null,null,null,null,null,null,null,null,null,null,null,null,null,null,null,null,null,null,null,null,null,null,null,null,null,null,null,null,null,null,null,null,null,null,null,null,null,null,null,null,null,null,null,null,null,null,null,null,null,null,null,null,null,null,null,null,null,null,null,null,null,null,null,null,null,null,"Midelværdi kvadrat",null,null,null,null,null,null,null,null,null,null,null,null,null,null,null,null,null,null,null,null,null,null,null,null,null,null,null,null,null,null,null,null,null,null,null,null,null,null,null,null,null,null,null,null,null,null,null,null,null,null,null,null,null,null,null,null,null,null,null,null,null,null,null,null,null,null,null,null,null,null,null,null,null,2,12,1.2,{"$f":"COUNTIF(GP$5:GP$26,GP6)","v":1},{"$f":"IF(GQ6>1,GP6+GO6/1000,GP6)","v":1.2},{"$f":"IF(_xlfn.RANK.EQ(GR6,$GR$5:$GR$37,0)>GS$5,(_xlfn.RANK.EQ(GR6,$GR$5:$GR$37,0)+1),(_xlfn.RANK.EQ(GR6,$GR$5:$GR$37,0)))","v":11},{"$f":"GP6^$GT$3","v":2.4883199999999999},null,null,"Pligtig efterafgrøde",{"$f":"IF('Efterafgrøde beslutningsstøtte'!A$7=GW6,\"Ja\",\"Nej\")","v":"Nej"},{"$f":"IF(GX6=\"Ja\",0,0)","v":0},{"$f":"GY6","v":0}]
[null,null,"2. Vårsæd",null,null,null,null,null,null,null,null,null,null,null,null,null,null,null,null,null,null,null,null,null,null,null,null,null,null,null,null,null,null,null,null,null,null,null,null,null,null,null,null,null,null,null,null,null,null,null,{"$f":"AVERAGE(AY41:AY74)","v":{"$error":"#DIV/0!"}},{"$f":"AVERAGE(AZ41:AZ74)","v":{"$error":"#DIV/0!"}},{"$error":"#DIV/0!"},{"$error":"#DIV/0!"},{"$error":"#DIV/0!"},{"$error":"#DIV/0!"},{"$error":"#DIV/0!"},{"$error":"#DIV/0!"},{"$error":"#DIV/0!"},{"$error":"#DIV/0!"},{"$error":"#DIV/0!"},{"$error":"#DIV/0!"},{"$error":"#DIV/0!"},{"$error":"#DIV/0!"},{"$error":"#DIV/0!"},{"$error":"#DIV/0!"},{"$error":"#DIV/0!"},{"$error":"#DIV/0!"},{"$f":"AVERAGE(BQ41:BQ74)","v":{"$error":"#DIV/0!"}},{"$f":"AVERAGE(BQ41:BQ74)","v":{"$error":"#DIV/0!"}},{"$f":"AVERAGE(BR41:BR74)","v":{"$error":"#DIV/0!"}},{"$f":"AVERAGE(BS41:BS74)","v":{"$error":"#DIV/0!"}},null,null,null,null,null,null,null,null,null,null,null,null,null,null,null,null,null,null,null,null,null,null,null,null,null,null,null,null,null,null,null,null,null,null,null,null,null,null,null,null,null,null,null,null,null,null,null,null,null,{"$f":"AVERAGE(DR41:DR74)","v":{"$error":"#DIV/0!"}},{"$f":"AVERAGE(DS41:DS74)","v":{"$error":"#DIV/0!"}},{"$f":"AVERAGE(DT41:DT74)","v":{"$error":"#DIV/0!"}},{"$error":"#DIV/0!"},{"$error":"#DIV/0!"},{"$error":"#DIV/0!"},{"$error":"#DIV/0!"},{"$error":"#DIV/0!"},{"$error":"#DIV/0!"},{"$error":"#DIV/0!"},{"$error":"#DIV/0!"},{"$error":"#DIV/0!"},{"$error":"#DIV/0!"},{"$error":"#DIV/0!"},{"$error":"#DIV/0!"},{"$error":"#DIV/0!"},{"$error":"#DIV/0!"},{"$error":"#DIV/0!"},{"$f":"AVERAGE(#REF!)","v":{"$error":"#REF!"}},{"$f":"AVERAGE(EJ41:EJ74)","v":{"$error":"#DIV/0!"}},{"$f":"AVERAGE(EK41:EK74)","v":{"$error":"#DIV/0!"}},{"$f":"AVERAGE(EL41:EL74)","v":{"$error":"#DIV/0!"}},null,null,null,null,null,null,null,null,null,null,null,null,null,null,null,null,null,null,null,null,null,null,null,null,null,null,null,null,null,null,null,null,null,null,null,null,null,null,null,null,null,null,null,null,null,null,null,null,null,null,null,null,3,11,1.1000000000000001,1,1.1000000000000001,{"$f":"IF(_xlfn.RANK.EQ(GR7,$GR$5:$GR$37,0)>GS$5,(_xlfn.RANK.EQ(GR7,$GR$5:$GR$37,0)+1),(_xlfn.RANK.EQ(GR7,$GR$5:$GR$37,0)))","v":12},{"$f":"GP7^$GT$3","v":1.6105100000000006},null,null,"Pligtig mellemafgrøde",{"$f":"IF('Efterafgrøde beslutningsstøtte'!A$7=GW7,\"Ja\",\"Nej\")","v":"Nej"},{"$f":"IF(GX7=\"Ja\",0,0)","v":0},0]
[null,null,null,null,null,null,null,null,null,null,null,null,null,null,null,null,null,null,null,null,null,null,null,null,null,null,null,null,null,null,null,null,null,null,null,null,null,null,null,null,null,null,null,null,null,null,null,null,null,null,null,null,null,null,null,null,null,null,null,null,null,null,null,null,null,null,null,null,null,null,null,null,null,null,null,null,null,null,null,null,null,null,null,null,null,null,null,null,null,null,null,null,null,null,null,null,null,null,null,null,null,null,null,null,null,null,null,null,null,null,null,null,null,null,null,null,null,null,null,null,null,{"$f":"IF(((DR7-AY7^2)^0.5)=0,10^-9,(DR7-AY7^2)^0.5)","v":{"$error":"#DIV/0!"}},{"$error":"#DIV/0!"},{"$error":"#DIV/0!"},{"$error":"#DIV/0!"},{"$error":"#DIV/0!"},{"$error":"#DIV/0!"},{"$error":"#DIV/0!"},{"$error":"#DIV/0!"},{"$error":"#DIV/0!"},{"$error":"#DIV/0!"},{"$error":"#DIV/0!"},{"$error":"#DIV/0!"},{"$error":"#DIV/0!"},{"$error":"#DIV/0!"},{"$error":"#DIV/0!"},{"$error":"#DIV/0!"},{"$error":"#DIV/0!"},{"$error":"#DIV/0!"},{"$error":"#REF!"},{"$error":"#DIV/0!"},{"$error":"#DIV/0!"},{"$error":"#DIV/0!"},null,null,null,null,null,null,null,null,null,null,null,null,null,null,null,null,null,null,null,null,null,null,null,null,null,null,null,null,null,null,null,null,null,null,null,null,null,null,null,null,null,null,null,null,null,null,null,null,null,null,null,null,4,10,1,1,1,13,1,null,null,"MFO-efterafgrøde i blanding2)",{"$f":"IF(OR('Efterafgrøde beslutningsstøtte'!A$7=\"Kun MFO afgrøde\",'Efterafgrøde beslutningsstøtte'!A$7=\"Pligtig efterafgrøde og MFO afgrøde\"),\"Ja\",\"Nej\")","v":"Nej"},0,0]
[null,null,null,null,null,null,null,null,null,null,null,null,null,null,null,null,null,null,null,null,null,null,null,null,null,null,null,null,null,null,null,null,null,null,null,null,null,null,null,null,null,null,null,null,null,null,null,null,null,null,null,null,null,null,null,null,null,null,null,null,null,null,null,null,null,null,null,null,null,null,null,null,null,null,null,null,null,null,null,null,null,null,null,null,null,null,null,null,null,null,null,null,null,null,null,null,null,null,null,null,null,null,null,null,null,null,null,null,null,null,null,null,null,null,null,null,null,null,null,null,null,"Standard afvigelse",null,null,null,null,null,null,null,null,null,null,null,null,null,null,null,null,null,null,null,null,null,null,null,null,null,null,null,null,null,null,null,null,null,null,null,null,null,null,null,null,null,null,null,null,null,null,null,null,null,null,null,null,null,null,null,null,null,null,null,null,null,null,null,null,null,null,null,null,null,null,null,null,null,5,9,0.9,1,0.9,14,0.59049000000000018,null,null,"MFO-udlæg3)",{"$f":"IF(OR('Efterafgrøde beslutningsstøtte'!A$7=\"Kun MFO afgrøde\",'Efterafgrøde beslutningsstøtte'!A$7=\"Pligtig efterafgrøde og MFO afgrøde\"),\"Ja\",\"Nej\")","v":"Nej"},0,0]
[null,null,null,null,null,null,null,null,null,null,null,null,null,null,null,null,null,null,null,null,null,null,null,null,null,null,null,null,null,null,null,null,null,null,null,null,null,null,null,null,null,null,null,null,null,null,null,null,null,null,null,null,null,null,null,null,null,null,null,null,null,null,null,null,null,null,null,null,null,null,null,null,null,null,null,null,null,null,null,null,null,null,null,null,null,null,null,null,null,null,null,null,null,null,null,null,null,null,null,null,null,null,null,null,null,null,null,null,null,null,null,null,null,null,null,null,null,null,null,null,null,null,null,null,null,null,null,null,null,null,null,null,null,null,null,null,null,null,null,null,null,null,null,null,null,null,null,null,null,null,null,null,null,null,null,null,null,null,null,null,null,null,null,null,null,null,null,null,null,null,null,null,null,null,null,null,null,null,null,null,null,null,null,null,null,null,null,null,null,null,null,null,null,null,null,6,8,0.8,1,0.8,15,0.32768000000000019,null,null,"Miljø-efterafgrøder",{"$f":"IF('Efterafgrøde beslutningsstøtte'!A$7=GW10,\"Ja\",\"Nej\")","v":"Nej"},0,0]
[null,null,null,null,null,null,null,null,null,null,null,null,null,null,null,null,null,null,null,null,null,null,null,null,null,null,null,null,null,null,null,null,null,null,null,null,null,null,null,null,null,null,null,null,null,null,null,null,null,null,null,null,null,null,null,null,null,null,null,null,null,null,null,null,null,null,null,null,null,null,null,null,null,null,null,null,null,null,null,null,null,null,null,null,null,null,null,null,null,null,null,null,null,null,null,null,null,null,null,null,null,null,null,null,null,null,null,null,null,null,null,null,null,null,null,null,null,null,null,null,null,null,null,null,null,null,null,null,null,null,null,null,null,null,null,null,null,null,null,null,null,null,null,null,null,null,null,null,null,null,null,null,null,null,null,null,"vgt",{"$f":"TRANSPOSE(GT5:GT37)","v":40.841010000000004},2.4883199999999999,1.6105100000000006,1,0.59049000000000018,0.32768000000000019,0.16806999999999994,7.7759999999999996E-2,3.125E-2,1.0240000000000006E-2,2.4299999999999999E-3,3.2000000000000019E-4,5.3782399999999981,3.712930000000001,7.59375,32,24.76099,18.895680000000006,14.198569999999997,10.485760000000006,1.0000000000000006E-5,0,0,0,0,0,0,0,0,0,0,0,0,null,null,null,null,null,7,7,0.7,1,0.7,16,0.16806999999999994,null,null,"Frivillig efterafgrøde",{"$f":"IF('Efterafgrøde beslutningsstøtte'!A$7=GW11,\"Ja\",\"Nej\")","v":"Nej"},0,0,1,2,3,4,5,6,7,8,9,10,11,12,13,14,15,16,17,18,19,20,21,22,23,24,25,26,27,28,29,30,31,32,33]
[null,null,null,null,null,null,null,null,null,null,null,null,null,null,null,null,null,null,null,null,null,null,null,null,null,null,null,null,null,null,null,null,null,null,null,null,null,null,null,null,null,null,null,null,null,null,null,null,null,null,null,null,null,null,null,null,null,null,null,null,null,null,null,null,null,null,null,null,null,null,null,null,null,null,null,null,null," ",null,null,null,null,null,null,null,null,null,null,null,null,null,null,null,null,null,null,null,null,null,null,null,null,null,null,null,null,null,null,null,null,null,null,null,null,null,null,null,null,null,null,null,null,null,null,null,null,null,null,null,null,null,null,null,null,null,null,null,null,null,null,null,null,null,null,null,null,null,null,null,null,null,null,null,null,null,null,null,null,null,null,null,null,null,null,null,null,null,null,null,null,null,null,null,null,null,null,null,null,null,null,null,null,null,null,null,null,null,null,null,null,null,null,null,null,null,8,6,0.6,1,0.6,17,7.7759999999999996E-2,null,null,"Grønne marker (2,3 DE-brug)",{"$f":"IF('Efterafgrøde beslutningsstøtte'!A$7=GW12,\"Ja\",\"Nej\")","v":"Nej"},0,0,{"$f":"MATCH(HA$11,$GS$5:$GS$37,0)","v":1},{"$f":"MATCH(HB$11,$GS$5:$GS$37,0)","v":33},{"$f":"MATCH(HC$11,$GS$5:$GS$37,0)","v":16},{"$f":"MATCH(HD$11,$GS$5:$GS$37,0)","v":17},{"$f":"MATCH(HE$11,$GS$5:$GS$37,0)","v":18},{"$f":"MATCH(HF$11,$GS$5:$GS$37,0)","v":19},{"$f":"MATCH(HG$11,$GS$5:$GS$37,0)","v":20},{"$f":"MATCH(HH$11,$GS$5:$GS$37,0)","v":15},13,14,{"$f":"MATCH(HK$11,$GS$5:$GS$37,0)","v":2},{"$f":"MATCH(HL$11,$GS$5:$GS$37,0)","v":3},4,5,6,7,8,9,10,11,12,21,{"$error":"#N/A"},{"$error":"#N/A"},{"$error":"#N/A"},{"$error":"#N/A"},{"$error":"#N/A"},{"$error":"#N/A"},{"$error":"#N/A"},{"$error":"#N/A"},{"$error":"#N/A"},{"$error":"#N/A"},{"$error":"#N/A"}]
[null,"Udfyldes af Hans!",null,null,null,null,null,null,null,null,null,null,null,null,null,null,null,null,null,null,null,null,null,null,null,null,null,null,null,null,null,null,null,null,null,null,null,null,null,null,null,null,null,null,null,null,null,null,null,null,null,null,null,null,null,null,null,null,null,null,null,null,null,null,null,null,null,null,null,null,null,null,null,null,null,null,null,null,null,null,null,null,null,null,null,null,null,null,null,null,null,null,null,null,null,null,null,null,null,null,null,null,null,null,null,null,null,null,null,null,null,null,null,null,null,null,null,null,null,null,null,null,null,null,null,null,null,null,null,null,null,null,null,null,null,null,null,null,null,null,null,null,null,null,null,null,null,null,null,null,null,null,null,null,null,null,null,null,null,null,null,null,null,null,null,null,null,null,null,null,null,null,null,null,null,null,null,null,null,null,null,null,null,null,null,null,null,null,null,null,null,null,null,null,null,9,5,{"$f":"IF(GX13=\"Ja\",GZ$2+GZ13+GO13/10,GZ13+GO13/10)","v":0.5},1,{"$f":"IF(GQ13>1,GP13+GO13/1000,GP13)","v":0.5},18,3.125E-2,null,null,"Egnet til udlæg efterår i vinterkorn",{"$f":"IF(Karaktermatrice!C21=1,\"Ja\",\"Nej\")","v":"Nej"},{"$f":"IF(GX13=\"Ja\",GZ$3,0)","v":0},0]
[null,null,null,null,null,null,null,null,null,null,null,null,null,null,null,null,null,null,null,null,null,null,null,null,null,null,null,null,null,null,null,null,null,null,null,null,null,null,null,null,null,null,null,null,null,null,null,null,null,null,null,null,null,null,null,null,null,null,null,null,null,null,null,null,null,null,null,null,null,null,null,null,null,null,null,null,null,null,null,null,null,null,null,null,null,null,null,null,null,null,null,null,null,null,null,null,null,null,null,null,null,null,null,null,null,null,null,null,null,null,null,null,null,null,null,null,null,null,null,null,null,null,null,null,null,null,null,null,null,null,null,null,null,null,null,null,null,null,null,null,null,null,null,null,null,null,null,null,null,null,null,null,null,null,null,null,null,null,null,null,null,null,null,null,null,null,null,null,null,null,null,null,null,null,null,null,null,null,null,null,null,null,null,null,null,null,null,null,null,null,null,null,null,null,null,10,4,{"$f":"IF(GX14=\"Ja\",GZ$2+GZ14+GO14/10,GZ14+GO14/10)","v":0.4},1,0.4,19,1.0240000000000006E-2,null,null,"Egnet til udlæg forår",{"$f":"IF(Karaktermatrice!C22=1,\"Ja\",\"Nej\")","v":"Nej"},{"$f":"IF(GX14=\"Ja\",GZ$3,0)","v":0},{"$f":"GY14","v":0}]
[null,null,null,null,null,null,null,null,null,null,null,null,null,null,null,null,null,null,null,null,null,null,null,null,null,null,null,null,null,null,null,null,null,null,null,null,null,null,null,null,null,null,null,null,null,null,null,null,null,null,null,null,null,null,null,null,null,null,null,null,null,null,null,null,null,null,null,null,null,null,null,null,null,null,null,null,null,null,null,null,null,null,null,null,null,null,null,null,null,null,null,null,null,null,null,null,null,null,null,null,null,null,null,null,null,null,null,null,null,null,null,null,null,null,null,null,null,null,null,null,null,null,null,null,null,null,null,null,null,null,null,null,null,null,null,null,null,null,null,null,null,null,null,null,null,null,null,null,null,null,null,null,null,null,null,null,null,null,null,null,null,null,null,null,null,null,null,null,null,null,null,null,null,null,null,null,null,null,null,null,null,null,null,null,null,null,null,null,null,null,null,null,null,null,null,11,3,{"$f":"IF(GX15=\"Ja\",GZ$2+GZ15+GO15/10,GZ15+GO15/10)","v":0.3},1,0.3,20,2.4299999999999999E-3,null,null,"Egnet til udsåning 2-3 uger før høst",{"$f":"IF(Karaktermatrice!C23=1,\"Ja\",\"Nej\")","v":"Nej"},0,0]
[null,null,null,null,null,null,null,null,null,null,null,null,null,null,null,null,null,null,null,null,null,null,null,null,null,null,null,null,null,null,null,null,null,null,null,null,null,null,null,null,null,null,null,null,null,null,null,null,null,null,null,null,null,null,null,null,null,null,null,null,null,null,null,null,null,null,null,null,null,null,null,null,null,null,null,null,null,null,null,null,null,null,null,null,null,null,null,null,null,null,null,null,null,null,null,null,null,null,null,null,null,null,null,null,null,null,null,null,null,null,null,null,null,null,null,null,null,null,null,null,null,null,null,null,null,null,null,null,null,null,null,null,null,null,null,null,null,null,null,null,null,null,null,null,null,null,null,null,null,null,null,null,null,null,null,null,null,null,null,null,null,null,null,null,null,null,null,null,null,null,null,null,null,null,null,null,null,null,null,null,null,null,null,null,null,null,null,null,null,null,null,null,null,null,null,12,2,{"$f":"IF(GX16=\"Ja\",GZ$2+GZ16+GO16/10,GZ16+GO16/10)","v":0.2},1,0.2,21,3.2000000000000019E-4,null,null,"Egnet til udsåning efter tidlig høst (10. august)",{"$f":"IF(Karaktermatrice!C24=1,\"Ja\",\"Nej\")","v":"Nej"},0,0]
[null,null,null,null,null,null,null,null,null,null,null,null,null,null,null,null,null,null,null,null,null,null,null,null,null,null,null,null,null,null,null,null,null,null,null,null,null,null,null,null,null,null,null,null,null,null,null,null,null,null,null,null,null,null,null,null,null,null,null,null,null,null,null,null,null,null,null,null,null,null,null,null,null,null,null,null,null,null,null,null,null,null,null,null,null,null,null,null,null,null,null,null,null,null,null,null,null,null,null,null,null,null,null,null,null,null,null,null,null,null,null,null,null,null,null,null,null,null,null,null,null,null,null,null,null,null,null,null,null,null,null,null,null,null,null,null,null,null,null,null,null,null,null,null,null,null,null,null,null,null,null,null,null,null,null,null,null,null,null,null,null,null,null,null,null,null,null,null,null,null,null,null,null,null,null,null,null,null,null,null,null,null,null,null,null,null,null,null,null,null,null,null,null,null,null,13,14,{"$f":"GZ17+GO17/10","v":1.4},1,1.4,9,5.3782399999999981,null,null,"Kvælstoffikserende",{"$f":"'Efterafgrøde beslutningsstøtte'!B37","v":"Ikke vigtigt"},{"$f":"VLOOKUP(GX17,Standard_karakterer,2,FALSE)","v":0},0]
[null,null,null,null,null,null,null,null,null,null,null,null,null,null,null,null,null,null,null,null,null,null,null,null,null,null,null,null,null,null,null,null,null,null,null,null,null,null,null,null,null,null,null,null,null,null,null,null,null,null,null,null,null,null,null,null,null,null,null,null,null,null,null,null,null,null,null,null,null,null,null,null,null,null,null,null,null,null,null,null,null,null,null,null,null,null,null,null,null,null,null,null,null,null,null,null,null,null,null,null,null,null,null,null,null,null,null,null,null,null,null,null,null,null,null,null,null,null,null,null,null,null,null,null,null,null,null,null,null,null,null,null,null,null,null,null,null,null,null,null,null,null,null,null,null,null,null,null,null,null,null,null,null,null,null,null,null,null,null,null,null,null,null,null,null,null,null,null,null,null,null,null,null,null,null,null,null,null,null,null,null,null,null,null,null,null,null,null,null,null,null,null,null,null,null,14,13,1.3,1,1.3,10,3.712930000000001,null,null,"Stor kvælstof-eftervirkning",{"$f":"'Efterafgrøde beslutningsstøtte'!B38","v":"Ikke vigtigt"},0,0]
[null,null,null,null,null,null,null,null,null,null,null,null,null,null,null,null,null,null,null,null,null,null,null,null,null,null,null,null,null,null,null,null,null,null,null,null,null,null,null,null,null,null,null,null,null,null,null,null,null,null,null,null,null,null,null,null,null,null,null,null,null,null,null,null,null,null,null,null,null,null,null,null,null,null,null,null,null,null,null,null,null,null,null,null,null,null,null,null,null,null,null,null,null,null,null,null,null,null,null,null,null,null,null,null,null,null,null,null,null,null,null,null,null,null,null,null,null,null,null,null,null,null,null,null,null,null,null,null,null,null,null,null,null,null,null,null,null,null,null,null,null,null,null,null,null,null,null,null,null,null,null,null,null,null,null,null,null,null,null,null,null,null,null,null,null,null,null,null,null,null,null,null,null,null,null,null,null,null,null,null,null,null,null,null,null,null,null,null,null,null,null,null,null,null,null,15,15,1.5,1,1.5,8,7.59375,null,null,"Hurtig og dyb rodvækst på lerjord",{"$f":"'Efterafgrøde beslutningsstøtte'!B34","v":"Ikke vigtigt"},0,0]
[null,null,null,null,null,null,null,null,null,null,null,null,null,null,null,null,null,null,null,null,null,null,null,null,null,null,null,null,null,null,null,null,null,null,null,null,null,null,null,null,null,null,null,null,null,null,null,null,null,null,null,null,null,null,null,null,null,null,null,null,null,null,null,null,null,null,null,null,null,null,null,null,null,null,null,null,null,null,null,null,null,null,null,null,null,null,null,null,null,null,null,null,null,null,null,null,null,null,null,null,null,null,null,null,null,null,null,null,null,null,null,null,null,null,null,null,null,null,null,null,null,null,null,null,null,null,null,null,null,null,null,null,null,null,null,null,null,null,null,null,null,null,null,null,null,null,null,null,null,null,null,null,null,null,null,null,null,null,null,null,null,null,null,null,null,null,null,null,null,null,null,null,null,null,null,null,null,null,null,null,null,null,null,null,null,null,null,null,null,null,null,null,null,null,null,16,20,2,1,2,3,32,null,null,"Er afgrøden robust mod ukrudtsmidler?",{"$f":"'Efterafgrøde beslutningsstøtte'!B27","v":"Ikke vigtigt"},{"$f":"VLOOKUP(GX20,Standard_karakterer,2,FALSE)","v":0},0]
[null,null,null,null,null,null,null,null,null,null,null,null,null,null,null,null,null,null,null,null,null,null,null,null,null,null,null,null,null,null,null,null,null,null,null,null,null,null,null,null,null,null,null,null,null,null,null,null,null,null,null,null,null,null,null,null,null,null,null,null,null,null,null,null,null,null,null,null,null,null,null,null,null,null,null,null,null,null,null,null,null,null,null,null,null,null,null,null,null,null,null,null,null,null,null,null,null,null,null,null,null,null,null,null,null,null,null,null,null,null,null,null,null,null,null,null,null,null,null,null,null,null,null,null,null,null,null,null,null,null,null,null,null,null,null,null,null,null,null,null,null,null,null,null,null,null,null,null,null,null,null,null,null,null,null,null,null,null,null,null,null,null,null,null,null,null,null,null,null,null,null,null,null,null,null,null,null,null,null,null,null,null,null,null,null,null,null,null,null,null,null,null,null,null,null,17,19,1.9,1,1.9,4,24.76099,null,null,"Der findes sorter, der ikke opformerer kålbrok",{"$f":"'Efterafgrøde beslutningsstøtte'!B28","v":"Ikke vigtigt"},{"$f":"VLOOKUP(GX21,Kålbrok_karaktere,2,FALSE)","v":0},0]
[null,null,null,null,null,null,null,null,null,null,null,null,null,null,null,null,null,null,null,null,null,null,null,null,null,null,null,null,null,null,null,null,null,null,null,null,null,null,null,null,null,null,null,null,null,null,null,null,null,null,null,null,null,null,null,null,null,null,null,null,null,null,null,null,null,null,null,null,null,null,null,null,null,null,null,null,null,null,null,null,null,null,null,null,null,null,null,null,null,null,null,null,null,null,null,null,null,null,null,null,null,null,null,null,null,null,null,null,null,null,null,null,null,null,null,null,null,null,null,null,null,null,null,null,null,null,null,null,null,null,null,null,null,null,null,null,null,null,null,null,null,null,null,null,null,null,null,null,null,null,null,null,null,null,null,null,null,null,null,null,null,null,null,null,null,null,null,null,null,null,null,null,null,null,null,null,null,null,null,null,null,null,null,null,null,null,null,null,null,null,null,null,null,null,null,18,18,1.8,{"$f":"COUNTIF(GP$5:GP$26,GP22)","v":1},{"$f":"IF(GQ22>1,GP22+GO22/1000,GP22)","v":1.8},5,18.895680000000006,null,null,"Der findes sorter, der er sanerende for roecystenematoder",{"$f":"'Efterafgrøde beslutningsstøtte'!B29","v":"Ikke vigtigt"},0,0]
[null,null,null,null,null,null,null,null,null,null,null,null,null,null,null,null,null,null,null,null,null,null,null,null,null,null,null,null,null,null,null,null,null,null,null,null,null,null,null,null,null,null,null,null,null,null,null,null,null,null,null,null,null,null,null,null,null,null,null,null,null,null,null,null,null,null,null,null,null,null,null,null,null,null,null,null,null,null,null,null,null,null,null,null,null,null,null,null,null,null,null,null,null,null,null,null,null,null,null,null,null,null,null,null,null,null," ",null,null,null,null,null,null,null,null,null,null,null,null,null,null,null,null,null,null,null,null,null,null,null,null,null,null,null,null,null,null,null,null,null,null,null,null,null,null,null,null,null,null,null,null,null,null,null,null,null,null,null,null,null,null,null,null,null,null,null,null,null,null,null,null,null,null,null,null,null,null,null,null,null,null,null,null,null,null,null,null,null,null,null,null,null,null,null,null,19,17,1.7,1,{"$f":"IF(GQ23>1,GP23+GO23/1000,GP23)","v":1.7},6,14.198569999999997,null,null,"Tom plads",{"$f":"'Efterafgrøde beslutningsstøtte'!B32","v":"Ikke vigtigt"},{"$f":"VLOOKUP(GX23,Standard_karakterer,2,FALSE)","v":0},{"$f":"GY23","v":0}]
[null,null,null,null,null,null,null,null,null,null,null,null,null,null,null,null,null,null,null,null,null,null,null,null,null,null,null,null,null,null,null,null,null,null,null,null,null,null,null,null,null,null,null,null,null,null,null,null,null,null,null,null,null,null,null,null,null,null,null,null,null,null,null,null,null,null,null,null,null,null,null,null,null,null,null,null,null,null,null,null,null,null,null,null,null,null,null,null,null,null,null,null,null,null,null,null,null,null,null,null,null,null,null,null,null,null,null,null,null,null,null,null,null,null,null,null,null,null,null,null,null,null,null,null,null,null,null,null,null,null,null,null,null,null,null,null,null,null,null,null,null,null,null,null,null,null,null,null,null,null,null,null,null,null,null,null,null,null,null,null,null,null,null,null,null,null,null,null,null,null,null,null,null,null,null,null,null,null,null,null,null,null,null,null,null,null,null,null,null,null,null,null,null,null,null,20,16,1.6,1,{"$f":"IF(GQ24>1,GP24+GO24/1000,GP24)","v":1.6},7,{"$f":"GP24^$GT$3","v":10.485760000000006},null,null,"Vinterfast",{"$f":"'Efterafgrøde beslutningsstøtte'!B33","v":"Ikke vigtigt"},{"$f":"VLOOKUP(GX24,Udsædskarakterer,2,FALSE)","v":0},{"$f":"GY24","v":0}]
[null,null,null,null,null,null,null,null,null,null,null,null,null,null,null,null,null,null,null,null,null,null,null,null,null,null,null,null,null,null,null,null,null,null,null,null,null,null,null,null,null,null,null,null,null,null,null,null,null,null,null,null,null,null,null,null,null,null,null,null,null,null,null,null,null,null,null,null,null,null,null,null,null,null,null,null,null,null,null,null,null,null,null,null,null,null,null,null,null,null,null,null,null,null,null,null,null,null,null,null,null,null,null,null,null,null,null,null,null,null,null,null,null,null,null,null,null,null,null,null,null,null,null,null,null,null,null,null,null,null,null,null,null,null,null,null,null,null,null,null,null,null,null,null,null,null,null,null,null,null,null,null,null,null,null,null,null,null,null,null,null,null,null,null,null,null,null,null,null,null,null,null,null,null,null,null,null,null,null,null,null,null,null,null,null,null,null,null,null,null,null,null,null,null,null,21,1,0.1,1,{"$f":"IF(GQ25>1,GP25+GO25/1000,GP25)","v":0.1},22,1.0000000000000006E-5,null,null,"Egen udsæd kan anvendes4)","Hovdespørgsmål",0,{"$f":"GY25","v":0}]
[null,null,null,null,null,null,null,null,null,null,null,null,null,null,null,null,null,null,null,null,null,null,null,null,null,null,null,null,null,null,null,null,null,null,null,null,null,null,null,null,null,null,null,null,null,null,null,null,null,null,null,null,null,null,null,null,null,null,null,null,null,null,null,null,null,null,null,null,null,null,null,null,null,null,null,null,null,null,null,null,null,null,null,null,null,null,null,null,null,null,null,null,null,null,null,null,null,null,null,null,null,null,null,null,null,null,null,null,null,null,null,null,null,null,null,null,null,null,null,null,null,null,null,null,null,null,null,null,null,null,null,null,null,null,null,null,null,null,null,null,null,null,null,null,null,null,null,null,null,null,null,null,null,null,null,null,null,null,null,null,null,null,null,null,null,null,null,null,null,null,null,null,null,null,null,null,null,null,null,null,null,null,null,null,null,null,null,null,null,null,null,null,null,null,null,22,null,null,null,null,null,null,null,null,"Tiebreak","Hovdespørgsmål",0,{"$f":"GY26","v":0}]
[null,null,null,null,null,null,null,null,null,null,null,null,null,null,null,null,null,null,null,null,null,null,null,null,null,null,null,null,null,null,null,null,null,null,null,null,null,null,null,null,null,null,null,null,null,null,null,null,null,null,null,null,null,null,null,null,null,null,null,null,null,null,null,null,null,null,null,null,null,null,null,null,null,null,null,null,null,null,null,null,null,null,null,null,null,null,null,null,null,null,null,null,null,null,null,null,null,null,null,null,null,null,null,null,null,null,null,null,null,null,null,null,null,null,null,null,null,null,null,null,null,null,null,null,null,null,null,null,null,null,null,null,null,null,null,null,null,null,null,null,null,null,null,null,null,null,null,null,null,null,null,null,null,null,null,null,null,null,null,null,null,null,null,null,null,null,null,null,null,null,null,null,null,null,null,null,null,null,null,null,null,null,null,null,null,null,null,null,null,null,null,null,null,null,null,23,null,null,null,null,null,null,null,null,null,"Hovdespørgsmål",0,0]
[null,null,null,null,null,null,null,null,null,null,null,null,null,null,null,null,null,null,null,null,null,null,null,null,null,null,null,null,null,null,null,null,null,null,null,null,null,null,null,null,null,null,null,null,null,null,null,null,null,null,null,null,null,null,null,null,null,null,null,null,null,null,null,null,null,null,null,null,null,null,null,null,null,null,null,null,null,null,null,null,null,null,null,null,null,null,null,null,null,null,null,null,null,null,null,null,null,null,null,null,null,null,null,null,null,null,null,null,null,null,null,null,null,null,null,null,null,null,null,null,null,null,null,null,null,null,null,null,null,null,null,null,null,null,null,null,null,null,null,null,null,null,null,null,null,null,null,null,null,null,null,null,null,null,null,null,null,null,null,null,null,null,null,null,null,null,null,null,null,null,null,null,null,null,null,null,null,null,null,null,null,null,null,null,null,null,null,null,null,null,null,null,null,null,null,24,null,null,null,null,null,null,null,null,null,"Hovdespørgsmål",0,0]
[null,null,null,null,null,null,null,null,null,null,null,null,null,null,null,null,null,null,null,null,null,null,null,null,null,null,null,null,null,null,null,null,null,null,null,null,null,null,null,null,null,null,null,null,null,null,null,null,null,null,null,null,null,null,null,null,null,null,null,null,null,null,null,null,null,null,null,null,null,null,null,null,null,null,null,null,null,null,null,null,null,null,null,null,null,null,null,null,null,null,null,null,null,null,null,null,null,null,null,null,null,null,null,null,null,null,null,null,null,null,null,null,null,null,null,null,null,null,null,null,null,null,null,null,null,null,null,null,null,null,null,null,null,null,null,null,null,null,null,null,null,null,null,null,null,null,null,null,null,null,null,null,null,null,null,null,null,null,null,null,null,null,null,null,null,null,null,null,null,null,null,null,null,null,null,null,null,null,null,null,null,null,null,null,null,null,null,null,null,null,null,null,null,null,null,25,null,null,null,null,null,null,null,null,null,"Hovdespørgsmål",0,0]
[null,null,null,null,null,null,null,null,null,null,null,null,null,null,null,null,null,null,null,null,null,null,null,null,null,null,null,null,null,null,null,null,null,null,null,null,null,null,null,null,null,null,null,null,null,null,null,null,null,null,null,null,null,null,null,null,null,null,null,null,null,null,null,null,null,null,null,null,null,null,null,null,null,null,null,null,null,null,null,null,null,null,null,null,null,null,null,null,null,null,null,null,null,null,null,null,null,null,null,null,null,null,null,null,null,null,null,null,null,null,null,null,null,null,null,null,null,null,null,null,null,null,null,null,null,null,null,null,null,null,null,null,null,null,null,null,null,null,null,null,null,null,null,null,null,null,null,null,null,null,null,null,null,null,null,null,null,null,null,null,null,null,null,null,null,null,null,null,null,null,null,null,null,null,null,null,null,null,null,null,null,null,null,null,null,null,null,null,null,null,null,null,null,null,null,26,null,null,null,null,null,null,null,null,null,"Hovdespørgsmål",0,0]
[null,null,null,null,null,null,null,null,null,null,null,null,null,null,null,null,null,null,null,null,null,null,null,null,null,null,null,null,null,null,null,null,null,null,null,null,null,null,null,null,null,null,null,null,null,null,null,null,null,null,null,null,null,null,null,null,null,null,null,null,null,null,null,null,null,null,null,null,null,null,null,null,null,null,null,null,null,null,null,null,null,null,null,null,null,null,null,null,null,null,null,null,null,null,null,null,null,null,null,null,null,null,null,null,null,null,null,null,null,null,null,null,null,null,null,null,null,null,null,null,null,null,null,null,null,null,null,null,null,null,null,null,null,null,null,null,null,null,null,null,null,null,null,null,null,null,null,null,null,null,null,null,null,null,null,null,null,null,null,null,null,null,null,null,null,null,null,null,null,null,null,null,null,null,null,null,null,null,null,null,null,null,null,null,null,null,null,null,null,null,null,null,null,null,null,27,null,null,null,null,null,null,null,null,null,"Hovdespørgsmål",0,0]
[null,null,null,null,null,null,null,null,null,null,null,null,null,null,null,null,null,null,null,null,null,null,null,null,null,null,null,null,null,null,null,null,null,null,null,null,null,null,null,null,null,null,null,null,null,null,null,null,null,null,null,null,null,null,null,null,null,null,null,null,null,null,null,null,null,null,null,null,null,null,null,null,null,null,null,null,null,null,null,null,null,null,null,null,null,null,null,null,null,null,null,null,null,null,null,null,null,null,null,null,null,null,null,null,null,null,null,null,null,null,null,null,null,null,null,null,null,null,null,null,null,null,null,null,null,null,null,null,null,null,null,null,null,null,null,null,null,null,null,null,null,null,null,null,null,null,null,null,null,null,null,null,null,null,null,null,null,null,null,null,null,null,null,null,null,null,null,null,null,null,null,null,null,null,null,null,null,null,null,null,null,null,null,null,null,null,null,null,null,null,null,null,null,null,null,28,null,null,null,null,null,null,null,null,null,"Hovdespørgsmål",0,0]
[null,null,null,null,null,null,null,null,null,null,null,null,null,null,null,null,null,null,null,null,null,null,null,null,null,null,null,null,null,null,null,null,null,null,null,null,null,null,null,null,null,null,null,null,null,null,null,null,null,null,null,null,null,null,null,null,null,null,null,null,null,null,null,null,null,null,null,null,null,null,null,null,null,null,null,null,null,null,null,null,null,null,null,null,null,null,null,null,null,null,null,null,null,null,null,null,null,null,null,null,null,null,null,null,null,null,null,null,null,null,null,null,null,null,null,null,null,null,null,null,null,null,null,null,null,null,null,null,null,null,null,null,null,null,null,null,null,null,null,null,null,null,null,null,null,null,null,null,null,null,null,null,null,null,null,null,null,null,null,null,null,null,null,null,null,null,null,null,null,null,null,null,null,null,null,null,null,null,null,null,null,null,null,null,null,null,null,null,null,null,null,null,null,null,null,29,null,null,null,null,null,null,null,null,null,"Hovdespørgsmål",0,0]
[null,null,null,null,null,null,null,null,null,null,null,null,null,null,null,null,null,null,null,null,null,null,null,null,null,null,null,null,null,null,null,null,null,null,null,null,null,null,null,null,null,null,null,null,null,null,null,null,null,null,null,null,null,null,null,null,null,null,null,null,null,null,null,null,null,null,null,null,null,null,null,null,null,null,null,null,null,null,null,null,null,null,null,null,null,null,null,null,null,null,null,null,null,null,null,null,null,null,null,null,null,null,null,null,null,null,null,null,null,null,null,null,null,null,null,null,null,null,null,null,null,null,null,null,null,null,null,null,null,null,null,null,null,null,null,null,null,null,null,null,null,null,null,null,null,null,null,null,null,null,null,null,null,null,null,null,null,null,null,null,null,null,null,null,null,null,null,null,null,null,null,null,null,null,null,null,null,null,null,null,null,null,null,null,null,null,null,null,null,null,null,null,null,null,null,30,null,null,null,null,null,null,null,null,null,"Hovdespørgsmål",0,0]
[null,null,null,null,null,null,null,null,null,null,null,null,null,null,null,null,null,null,null,null,null,null,null,null,null,null,null,null,null,null,null,null,null,null,null,null,null,null,null,null,null,null,null,null,null,null,null,null,null,null,null,null,null,null,null,null,null,null,null,null,null,null,null,null,null,null,null,null,null,null,null,null,null,null,null,null,null,null,null,null,null,null,null,null,null,null,null,null,null,null,null,null,null,null,null,null,null,null,null,null,null,null,null,null,null,null,null,null,null,null,null,null,null,null,null,null,null,null,null,null,null,null,null,null,null,null,null,null,null,null,null,null,null,null,null,null,null,null,null,null,null,null,null,null,null,null,null,null,null,null,null,null,null,null,null,null,null,null,null,null,null,null,null,null,null,null,null,null,null,null,null,null,null,null,null,null,null,null,null,null,null,null,null,null,null,null,null,null,null,null,null,null,null,null,null,31,null,null,null,null,null,null,null,null,null,"Hovdespørgsmål",0,0]
[null,null,null,null,null,null,null,null,null,null,null,null,null,null,null,null,null,null,null,null,null,null,null,null,null,null,null,null,null,null,null,null,null,null,null,null,null,null,null,null,null,null,null,null,null,null,null,null,null,null,null,null,null,null,null,null,null,null,null,null,null,null,null,null,null,null,null,null,null,null,null,null,null,null,null,null,null,null,null,null,null,null,null,null,null,null,null,null,null,null,null,null,null,null,null,null,null,null,null,null,null,null,null,null,null,null,null,null,null,null,null,null,null,null,null,null,null,null,null,null,null,null,null,null,null,null,null,null,null,null,null,null,null,null,null,null,null,null,null,null,null,null,null,null,null,null,null,null,null,null,null,null,null,null,null,null,null,null,"Pil kriterie afgrøder ud",null,null,null,null,null,null,null,null,null,null,null,null,null,null,null,null,null,null,null,null,null,null,null,null,null,null,null,null,null,null,null,null,null,null,null,null,32,null,null,null,null,null,null,null,null,null,"Hovdespørgsmål",0,0]
[null,null,null,null,null,null,null,null,null,null,null,null,null,null,null,null,null,null,null,null,null,null,null,null,null,null,null,"Plads til fremtidige karaktere",null,null,null,null,null,null,null,null,null,null,null,null,null,null,null,null,null,null,null,null,null,null,null,null,null,null,null,null,null,null,null,null,null,null,null,null,null,null,null,null,null,null,null,null,null,null,null,null,null,null,null,null,null,null,null,null,null,null,null,null,null,null,null,null,null,null,null,null,null,null,null,null,null,null,null,null,null,null,null,null,null,null,null,null,null,null,null,null,null,null,null,null,null,null,null,null,null,null,null,null,null,null,null,null,null,null,null,null,null,null,null,null,null,null,null,null,null,null,null,null,null,null,null,null,null,null,null,null,null,null,"Lav en måde at breake ties",null,null,null,null,null,null,null,null,null,null,null,null,null,null,null,null,null,null,null,null,null,null,null,null,null,null,null,null,null,null,null,null,null,null,null,null,33,"Etableringsomkostninger (ikke prioriteret efter)",null,null,null,{"$f":"GS5+1","v":2},null,null,null,null,"Hovdespørgsmål",0,0]
[null,null,null,null,null,7,8,9,10,11,12,13,14,15,16,17,18,19,20,21,22,23,24,25,26,27,28,29,30,31,32,33,34,35,36,37,38,39,null,null,null,null,null,null,null,null,null,null,null,null,null,null,null,null,null,null,null,null,null,null,null,null,null,null,null,null,null,null,null,null,null,null,null,null,null,null,null,null,null,null,null,null,null,null,null,null,null,null,null,null,null,null,null,null,null,null,null,null,null,null,null,null,null,null,null,null,null,null,null,null,null,null,null,null,null,null,null,null,null,null,null,"Kvadrat"]
[null,null,null,null,null,1,2,3,4,5,6,7,8,9,10,11,12,13,14,15,16,17,18,19,20,21,22,23,24,25,26,27,28,29,30,31,32,33,34,35,36,37,38,39,40,null,null,null,null,null,1,2,3,4,5,6,7,8,9,10,11,12,13,14,15,16,17,18,19,20,21,22,23,24,25,26,27,28,29,30,31,32,33,null,null,{"$f":"AY39","v":1},{"$f":"AZ39","v":2},3,4,5,6,7,8,9,10,11,12,13,14,15,16,17,18,19,20,21,22,23,24,25,26,27,28,29,{"$f":"CB39","v":30},{"$f":"CC39","v":31},{"$f":"CD39","v":32},{"$f":"CE39","v":33},null,null,null,1,2,3,4,5,6,7,8,9,10,11,12,13,14,15,16,17,18,19,20,21,22,23,24,25,26,27,28,29,30,31,32,33,null,null,null,1,2,3,4,5,6,7,8,9,10,11,12,13,14,15,16,17,18,19,20,21,22,23,24,25,26,27,28,29,30,31,32,33,"Scoreberegning",null,null,null,null,null,null,null,null,null,null,null,null,null,null,null,null,null,{"$f":"INDEX($AY39:$DP39,HA$12)","v":1},null,null,null,null,null,null,null,null,null,null,null,null,null,null,null,null,null,null,null,null,null,null,null,null,null,null,null,null,null,null,null,{"$f":"INDEX($AY39:$DP39,HB$12)","v":33}]
["Index","Efterafgrøde","Afgrøde","Tidspunkt","Link","Pris","Pligtig efterafgrøde","Pligtig mellemafgrøde","MFO-efterafgrøde i blanding2)","MFO-udlæg","Miljø-efterafgrøder","Frivillig efterafgrøde","Grønne marker (2,3 DE-brug)","Egnet til udlæg efterår i vinterkorn","Egnet til udlæg forår","Egnet til udsåning 2-3 uger før høst","Egnet til udsåning efter tidlig høst (10. august)","Kvælstoffikserende","Stor kvælstof-eftervirkning","Hurtig og dyb rodvækst på lerjord","Er afgrøden robust mod ukrudtsmidler?","Der findes sorter, der ikke opformerer kålbrok","Der findes sorter, der er sanerende for roecystenematoder","Tom plads","Vinterfast","Egen udsæd kan anvendes","Tiebreak","Kommentare til ukurdt",null,null,null,null,null,null,null,null,null,"Nettoomkostninger",null,null,null,null,null,null,null,null,null,null,null,null,{"$f":"F40","v":"Pris"},"Pligtig efterafgrøde","Pligtig mellemafgrøde","MFO-efterafgrøde i blanding2)","MFO-udlæg","Miljø-efterafgrøder","Frivillig efterafgrøde","Grønne marker (2,3 DE-brug)","Egnet til udlæg efterår i vinterkorn","Egnet til udlæg forår","Egnet til udsåning 2-3 uger før høst","Egnet til udsåning efter tidlig høst (10. august)","Kvælstoffikserende","Stor kvælstof-eftervirkning","Hurtig og dyb rodvækst på lerjord","Er afgrøden robust mod ukrudtsmidler?","Der findes sorter, der ikke opformerer kålbrok",{"$f":"W40","v":"Der findes sorter, der er sanerende for roecystenematoder"},{"$f":"Y40","v":"Vinterfast"},{"$f":"Z40","v":"Egen udsæd kan anvendes"},"Tiebreak","Kommentare ang. Ukrudt",null,null,null,null,null,null,null,null,null,null,"Nettoomkostninger",null,null,{"$f":"AY40","v":"Pris"},"Pligtig efterafgrøde","Pligtig mellemafgrøde","MFO-efterafgrøde i blanding2)","MFO-udlæg","Miljø-efterafgrøder","Frivillig efterafgrøde","Grønne marker (2,3 DE-brug)","Egnet til udlæg efterår i vinterkorn","Egnet til udlæg forår","Egnet til udsåning 2-3 uger før høst","Egnet til udsåning efter tidlig høst (10. august)","Kvælstoffikserende","Stor kvælstof-eftervirkning","Hurtig og dyb rodvækst på lerjord","Er afgrøden robust mod ukrudtsmidler?","Der findes sorter, der ikke opformerer kålbrok","Der findes sorter, der er sanerende for roecystenematoder","Vinterfast","Egen udsæd kan anvendes","Tiebreak","Kommentare ang. Ukrudt",0,0,0,0,0,0,0,{"$f":"CB40","v":0},0,0,"Nettoomkostninger",null,null,null,{"$f":"AY40","v":"Pris"},"Pligtig efterafgrøde","Pligtig mellemafgrøde","MFO-efterafgrøde i blanding2)","MFO-udlæg","Miljø-efterafgrøder","Frivillig efterafgrøde","Grønne marker (2,3 DE-brug)","Egnet til udlæg efterår i vinterkorn","Egnet til udlæg forår","Egnet til udsåning 2-3 uger før høst","Egnet til udsåning efter tidlig høst (10. august)","Kvælstoffikserende","Stor kvælstof-eftervirkning","Hurtig og dyb rodvækst på lerjord","Er afgrøden robust mod ukrudtsmidler?","Der findes sorter, der ikke opformerer kålbrok","Der findes sorter, der er sanerende for roecystenematoder","Vinterfast","Egen udsæd kan anvendes",{"$f":"BS40","v":"Tiebreak"},null,null,null,null,null,null,null,null,null,null,null,null,null,null,null,{"$f":"DR40","v":"Pris"},{"$f":"DS40","v":"Pligtig efterafgrøde"},"Pligtig mellemafgrøde","MFO-efterafgrøde i blanding2)","MFO-udlæg","Miljø-efterafgrøder","Frivillig efterafgrøde","Grønne marker (2,3 DE-brug)","Egnet til udlæg efterår i vinterkorn","Egnet til udlæg forår","Egnet til udsåning 2-3 uger før høst","Egnet til udsåning efter tidlig høst (10. august)","Kvælstoffikserende","Stor kvælstof-eftervirkning","Hurtig og dyb rodvækst på lerjord","Er afgrøden robust mod ukrudtsmidler?","Der findes sorter, der ikke opformerer kålbrok","Der findes sorter, der er sanerende for roecystenematoder",{"$f":"EJ40","v":"Vinterfast"},{"$f":"EK40","v":"Egen udsæd kan anvendes"},{"$f":"EL40","v":"Tiebreak"},0,0,0,0,0,0,0,0,0,0,0,0,"Sumprodukt vægt og Zscore","Score","Tiebreak","Score corected for ties","Placering",null,null,null,null,null,"Check for ties and all places","Place",null,"Plads",null,null,null,"Efterafgrøde",{"$f":"INDEX($AY40:$CE40,HA$12)","v":"Pris"},{"$f":"INDEX($AY40:$CE40,HB$12)","v":"Nettoomkostninger"},{"$f":"INDEX($AY40:$CE40,HC$12)","v":"Er afgrøden robust mod ukrudtsmidler?"},{"$f":"INDEX($AY40:$CE40,HD$12)","v":"Der findes sorter, der ikke opformerer kålbrok"},"Der findes sorter, der er sanerende for roecystenematoder","Vinterfast",{"$f":"INDEX($AY40:$CE40,HG$12)","v":"Egen udsæd kan anvendes"},{"$f":"INDEX($AY40:$CE40,HH$12)","v":"Hurtig og dyb rodvækst på lerjord"},"Kvælstoffikserende","Stor kvælstof-eftervirkning","Pligtig efterafgrøde","Pligtig mellemafgrøde","MFO-efterafgrøde i blanding2)","MFO-udlæg","Miljø-efterafgrøder","Frivillig efterafgrøde","Grønne marker (2,3 DE-brug)","Egnet til udlæg efterår i vinterkorn","Egnet til udlæg forår","Egnet til udsåning 2-3 uger før høst","Egnet til udsåning efter tidlig høst (10. august)",null,null,null,null,null,null,null,null,null,null,null,null,"Vejledning","Kommentare ang ukrudt"]
[1,"Alm. rajgræs, dipl., udlæg",null,null,{"$f":"IF('Efterafgrøde beslutningsstøtte'!A$7<>\"Pligtig mellemafgrøde\",HYPERLINK(\"https://dyrk-plant.dlbr.dk/Web/(S(ikevr3oqnx5oe2t5cyfyknyq))/forms/Main.aspx?page=Vejledning&cropID=226\",\"Efterafgrøder\"),HYPERLINK(\"https://dyrk-plant.dlbr.dk/Web/(S(0x3ftyiaahcpttq0ljebuany))/forms/Main.aspx?page=Vejledning&cropID=238\",\"Mellemafgrøder\"))","v":"Efterafgrøder"},{"$f":"VLOOKUP($A41,Karaktermatrice,F$38,FALSE)","v":"xx"},{"$f":"VLOOKUP($A41,Karaktermatrice,G$38,FALSE)","v":"xx"},{"$f":"VLOOKUP($A41,Karaktermatrice,H$38,FALSE)","v":"xx"},"xx","xx",{"$f":"VLOOKUP($A41,Karaktermatrice,K$38,FALSE)","v":"xx"},{"$f":"VLOOKUP($A41,Karaktermatrice,L$38,FALSE)","v":"xx"},"xx",{"$f":"VLOOKUP($A41,Karaktermatrice,N$38,FALSE)","v":"xx"},"xx",{"$f":"VLOOKUP($A41,Karaktermatrice,P$38,FALSE)","v":"xx"},"xx","xx","xx","xx","xx","xx",{"$f":"VLOOKUP($A41,Karaktermatrice,W$38,FALSE)","v":"xx"},"xx","xx","xx","xx",{"$f":"VLOOKUP($A41,Karaktermatrice,AB$38,FALSE)","v":"xx"},null,null,null,null,null,null,null,null,null,{"$f":"VLOOKUP($A41,Karaktermatrice,AC$38,FALSE)","v":"xx"},null,null,null,null,null,null,null,null,null,null,null,null,{"$f":"F41","v":"xx"},{"$f":"G41","v":"xx"},"xx","xx","xx","xx","xx","xx","xx","xx","xx","xx","xx","xx","xx","xx","xx","xx",{"$f":"Y41","v":"xx"},{"$f":"Z41","v":"xx"},"xx",{"$f":"AB41","v":"xx"},null,null,null,null,null,null,null,null,null,null,{"$f":"AL41","v":"xx"},null,null,{"$f":"IF(AY41=\"xx\",\"xx\",ROUND(AY41,0))","v":"xx"},{"$f":"IF(AZ41=0,\"Nej\",IF(AZ41=1,\"Ja\",\"xx\"))","v":"xx"},{"$f":"IF(BA41=0,\"Nej\",IF(BA41=1,\"Ja\",\"xx\"))","v":"xx"},"xx","xx",{"$f":"IF(BD41=0,\"Nej\",IF(BD41=1,\"Ja\",\"xx\"))","v":"xx"},{"$f":"IF(BE41=0,\"Nej\",IF(BE41=1,\"Ja\",\"xx\"))","v":"xx"},"xx",{"$f":"IF(BG41=0,\"Nej\",IF(BG41=1,\"Brugbar\",IF(BG41=2,\"God\",IF(BG41=3,\"Meget god\",\"xx\"))))","v":"xx"},{"$f":"IF(BH41=0,\"Nej\",IF(BH41=1,\"Brugbar\",IF(BH41=2,\"God\",IF(BH41=3,\"Meget god\",\"xx\"))))","v":"xx"},"xx","xx",{"$f":"IF(BK41=0,\"Nej\",IF(BK41=1,\"Ja\",\"xx\"))","v":"xx"},{"$f":"IF(BL41=0,\"Lille\",IF(BL41=1,\"Middel\",IF(BL41=2,\"Over middel\",IF(BL41=3,\"Stor\",\"xx\"))))","v":"xx"},{"$f":"IF(BM41=0,\"Nej\",IF(BM41=1,\"Rimelig\",IF(BM41=2,\"God\",IF(BM41=3,\"Meget god\",\"xx\"))))","v":"xx"},{"$f":"IF(BN41=0,\"Nej\",IF(BN41=1,\"Mod visse\",IF(BN41=2,\"Mod mange\",IF(BN41=3,\"Mod de fleste\",\"xx\"))))","v":"xx"},{"$f":"IF(BO41=0,\"Nej\",IF(BO41=1,\"Få\",IF(BO41=2,\"Nogle\",IF(BO41=3,\"Mange\",\"xx\"))))","v":"xx"},{"$f":"IF(BP41=0,\"Nej\",IF(BP41=1,\"Få\",IF(BP41=2,\"Nogle\",IF(BP41=3,\"Mange\",\"xx\"))))","v":"xx"},{"$f":"IF(BQ41=0,\"Udvintre\",IF(BQ41=1,\"Dårlig\",IF(BQ41=2,\"God\",IF(BQ41=3,\"Meget god\",\"xx\"))))","v":"xx"},{"$f":"IF(BR41=0,\"Nej\",IF(BR41=1,\"Ja\",\"xx\"))","v":"xx"},null,{"$f":"BT41","v":"xx"},null,null,null,null,null,null,null,null,null,null,{"$f":"CE41","v":"xx"},null,null,null,{"$f":"IF(AY41<>\"xx\",AY41^2,\"xx\")","v":"xx"},{"$f":"IF(AZ41<>\"xx\",AZ41^2,\"xx\")","v":"xx"},{"$f":"IF(BA41<>\"xx\",BA41^2,\"xx\")","v":"xx"},{"$f":"IF(BB41<>\"xx\",BB41^2,\"xx\")","v":"xx"},{"$f":"IF(BC41<>\"xx\",BC41^2,\"xx\")","v":"xx"},{"$f":"IF(BD41<>\"xx\",BD41^2,\"xx\")","v":"xx"},{"$f":"IF(BE41<>\"xx\",BE41^2,\"xx\")","v":"xx"},{"$f":"IF(BF41<>\"xx\",BF41^2,\"xx\")","v":"xx"},{"$f":"IF(BG41<>\"xx\",BG41^2,\"xx\")","v":"xx"},{"$f":"IF(BH41<>\"xx\",BH41^2,\"xx\")","v":"xx"},{"$f":"IF(BI41<>\"xx\",BI41^2,\"xx\")","v":"xx"},{"$f":"IF(BJ41<>\"xx\",BJ41^2,\"xx\")","v":"xx"},{"$f":"IF(BK41<>\"xx\",BK41^2,\"xx\")","v":"xx"},{"$f":"IF(BL41<>\"xx\",BL41^2,\"xx\")","v":"xx"},{"$f":"IF(BM41<>\"xx\",BM41^2,\"xx\")","v":"xx"},{"$f":"IF(BN41<>\"xx\",BN41^2,\"xx\")","v":"xx"},{"$f":"IF(BO41<>\"xx\",BO41^2,\"xx\")","v":"xx"},{"$f":"IF(BP41<>\"xx\",BP41^2,\"xx\")","v":"xx"},{"$f":"IF(BQ41<>\"xx\",BQ41^2,\"xx\")","v":"xx"},{"$f":"IF(BQ41<>\"xx\",BQ41^2,\"xx\")","v":"xx"},{"$f":"IF(BS41<>\"xx\",BS41^2,\"xx\")","v":"xx"},null,null,null,null,null,null,null,null,null,null,null,null,null,null,null,{"$f":"IF(DR41=\"xx\",\"xx\",(AY41-AY$7)/DR$8)","v":"xx"},{"$f":"IF(DS41=\"xx\",\"xx\",(AZ41-AZ$7)/DS$8)","v":"xx"},{"$f":"IF(DT41=\"xx\",\"xx\",(BA41-BA$7)/DT$8)","v":"xx"},{"$f":"IF(DU41=\"xx\",\"xx\",(BB41-BB$7)/DU$8)","v":"xx"},{"$f":"IF(DV41=\"xx\",\"xx\",(BC41-BC$7)/DV$8)","v":"xx"},{"$f":"IF(DW41=\"xx\",\"xx\",(BD41-BD$7)/DW$8)","v":"xx"},{"$f":"IF(DX41=\"xx\",\"xx\",(BE41-BE$7)/DX$8)","v":"xx"},{"$f":"IF(DY41=\"xx\",\"xx\",(BF41-BF$7)/DY$8)","v":"xx"},{"$f":"IF(DZ41=\"xx\",\"xx\",(BG41-BG$7)/DZ$8)","v":"xx"},{"$f":"IF(EA41=\"xx\",\"xx\",(BH41-BH$7)/EA$8)","v":"xx"},{"$f":"IF(EB41=\"xx\",\"xx\",(BI41-BI$7)/EB$8)","v":"xx"},{"$f":"IF(EC41=\"xx\",\"xx\",(BJ41-BJ$7)/EC$8)","v":"xx"},{"$f":"IF(ED41=\"xx\",\"xx\",(BK41-BK$7)/ED$8)","v":"xx"},{"$f":"IF(EE41=\"xx\",\"xx\",(BL41-BL$7)/EE$8)","v":"xx"},{"$f":"IF(EF41=\"xx\",\"xx\",(BM41-BM$7)/EF$8)","v":"xx"},{"$f":"IF(EG41=\"xx\",\"xx\",(BN41-BN$7)/EG$8)","v":"xx"},{"$f":"IF(EH41=\"xx\",\"xx\",(BO41-BO$7)/EH$8)","v":"xx"},{"$f":"IF(EI41=\"xx\",\"xx\",(BP41-BP$7)/EI$8)","v":"xx"},{"$f":"IF(EJ41=\"xx\",\"xx\",(BQ41-BR$7)/EK$8)","v":"xx"},{"$f":"IF(EK41=\"xx\",\"xx\",(BQ41-BS$7)/EL$8)","v":"xx"},{"$f":"IF(EL41=\"xx\",\"xx\",(BS41-BT$7)/EM$8)","v":"xx"},null,null,null,null,null,null,null,null,null,null,null,null,{"$f":"SUMPRODUCT($FB$11:$FV$11,FB41:FV41)","v":0},{"$f":"IF(FB41=\"xx\",\"xx\",GI41)","v":"xx"},{"$f":"IF(GJ41=\"xx\",\"xx\",IF(COUNTIF($GJ$41:$GJ$74,GJ41)>1,RANK(AL41,AL$41:AL$70,1)/1000,0))","v":"xx"},{"$f":"IF(OR(GJ41=\"xx\",GK41=\"xx\"),\"xx\",GK41+GJ41)","v":"xx"},{"$f":"IF(GL41=\"xx\",99,RANK(GL41,$GL$41:$GL$112))","v":99},null,null,null,null,null,{"$f":"COUNTIF($GM$41:$GM$112,GV41)","v":0},{"$f":"IF(GS41>0,MATCH(GV41,$GM$41:$GM$112,0),\"xx\")","v":"xx"},null,1,null,null,null,{"$f":"IF($GS41=0,\"xx\",INDEX($B$41:$B$112,$GT41))","v":"xx"},{"$f":"IF($GS41=0,\"xx\",INDEX($CH$41:$DN$112,$GT41,HA$12))","v":"xx"},{"$f":"IF($GS41=0,\"xx\",INDEX($CH$41:$DN$112,$GT41,HB$12))","v":"xx"},{"$f":"IF($GS41=0,\"xx\",INDEX($CH$41:$DN$112,$GT41,HC$12))","v":"xx"},{"$f":"IF($GS41=0,\"xx\",INDEX($CH$41:$DN$112,$GT41,HD$12))","v":"xx"},"xx","xx","xx","xx","xx","xx","xx","xx","xx","xx","xx","xx","xx","xx","xx","xx",{"$f":"IF($GS41=0,\"xx\",INDEX($CH$41:$DN$112,$GT41,HU$12))","v":"xx"},null,null,null,null,null,null,null,null,null,null,null,null,{"$f":"IF($GS41=0,\"xx\",INDEX($E$41:$E$127,$GT41))","v":"xx"}]
[2,"Ital. rajgræs, dipl., udlæg",null,null,{"$f":"IF('Efterafgrøde beslutningsstøtte'!A$7<>\"Pligtig mellemafgrøde\",HYPERLINK(\"https://dyrk-plant.dlbr.dk/Web/(S(ikevr3oqnx5oe2t5cyfyknyq))/forms/Main.aspx?page=Vejledning&cropID=226\",\"Efterafgrøder\"),HYPERLINK(\"https://dyrk-plant.dlbr.dk/Web/(S(0x3ftyiaahcpttq0ljebuany))/forms/Main.aspx?page=Vejledning&cropID=238\",\"Mellemafgrøder\"))","v":"Efterafgrøder"},"xx","xx","xx","xx","xx","xx","xx","xx","xx","xx","xx","xx","xx","xx","xx","xx","xx","xx","xx","xx","xx","xx","xx",null,null,null,null,null,null,null,null,null,"xx",null,null,null,null,null,null,null,null,null,null,null,null,"xx","xx","xx","xx","xx","xx","xx","xx","xx","xx","xx","xx","xx","xx","xx","xx","xx","xx",{"$f":"Y42","v":"xx"},"xx","xx","xx",null,null,null,null,null,null,null,null,null,null,{"$f":"AL42","v":"xx"},null,null,{"$f":"IF(AY42=\"xx\",\"xx\",ROUND(AY42,0))","v":"xx"},{"$f":"IF(AZ42=0,\"Nej\",IF(AZ42=1,\"Ja\",\"xx\"))","v":"xx"},{"$f":"IF(BA42=0,\"Nej\",IF(BA42=1,\"Ja\",\"xx\"))","v":"xx"},{"$f":"IF(BB42=0,\"Nej\",IF(BB42=1,\"Ja\",\"xx\"))","v":"xx"},{"$f":"IF(BC42=0,\"Nej\",IF(BC42=1,\"Ja\",\"xx\"))","v":"xx"},{"$f":"IF(BD42=0,\"Nej\",IF(BD42=1,\"Ja\",\"xx\"))","v":"xx"},{"$f":"IF(BE42=0,\"Nej\",IF(BE42=1,\"Ja\",\"xx\"))","v":"xx"},{"$f":"IF(BF42=0,\"Nej\",IF(BF42=1,\"Ja\",\"xx\"))","v":"xx"},{"$f":"IF(BG42=0,\"Nej\",IF(BG42=1,\"Brugbar\",IF(BG42=2,\"God\",IF(BG42=3,\"Meget god\",\"xx\"))))","v":"xx"},{"$f":"IF(BH42=0,\"Nej\",IF(BH42=1,\"Brugbar\",IF(BH42=2,\"God\",IF(BH42=3,\"Meget god\",\"xx\"))))","v":"xx"},{"$f":"IF(BI42=0,\"Nej\",IF(BI42=1,\"Brugbar\",IF(BI42=2,\"God\",IF(BI42=3,\"Meget god\",\"xx\"))))","v":"xx"},{"$f":"IF(BJ42=0,\"Nej\",IF(BJ42=1,\"Brugbar\",IF(BJ42=2,\"God\",IF(BJ42=3,\"Meget god\",\"xx\"))))","v":"xx"},{"$f":"IF(BK42=0,\"Nej\",IF(BK42=1,\"Ja\",\"xx\"))","v":"xx"},{"$f":"IF(BL42=0,\"Lille\",IF(BL42=1,\"Middel\",IF(BL42=2,\"Over middel\",IF(BL42=3,\"Stor\",\"xx\"))))","v":"xx"},{"$f":"IF(BM42=0,\"Nej\",IF(BM42=1,\"Rimelig\",IF(BM42=2,\"God\",IF(BM42=3,\"Meget god\",\"xx\"))))","v":"xx"},{"$f":"IF(BN42=0,\"Nej\",IF(BN42=1,\"Mod visse\",IF(BN42=2,\"Mod mange\",IF(BN42=3,\"Mod de fleste\",\"xx\"))))","v":"xx"},{"$f":"IF(BO42=0,\"Nej\",IF(BO42=1,\"Få\",IF(BO42=2,\"Nogle\",IF(BO42=3,\"Mange\",\"xx\"))))","v":"xx"},{"$f":"IF(BP42=0,\"Nej\",IF(BP42=1,\"Få\",IF(BP42=2,\"Nogle\",IF(BP42=3,\"Mange\",\"xx\"))))","v":"xx"},{"$f":"IF(BQ42=0,\"Udvintre\",IF(BQ42=1,\"Dårlig\",IF(BQ42=2,\"God\",IF(BQ42=3,\"Meget god\",\"xx\"))))","v":"xx"},{"$f":"IF(BR42=0,\"Nej\",IF(BR42=1,\"Ja\",\"xx\"))","v":"xx"},null,{"$f":"BT42","v":"xx"},null,null,null,null,null,null,null,null,null,null,{"$f":"CE42","v":"xx"},null,null,null,"xx","xx","xx","xx","xx","xx","xx","xx","xx","xx","xx","xx","xx","xx","xx","xx","xx","xx",{"$f":"IF(BQ42<>\"xx\",BQ42^2,\"xx\")","v":"xx"},{"$f":"IF(BR42<>\"xx\",BR42^2,\"xx\")","v":"xx"},"xx",null,null,null,null,null,null,null,null,null,null,null,null,null,null,null,"xx","xx","xx","xx","xx","xx","xx","xx","xx","xx","xx","xx","xx","xx","xx","xx","xx",{"$f":"IF(EI42=\"xx\",\"xx\",(BP42-BP$7)/EI$8)","v":"xx"},{"$f":"IF(EJ42=\"xx\",\"xx\",(BQ42-BR$7)/EK$8)","v":"xx"},{"$f":"IF(EK42=\"xx\",\"xx\",(BR42-BS$7)/EL$8)","v":"xx"},"xx",null,null,null,null,null,null,null,null,null,null,null,null,{"$f":"SUMPRODUCT($FB$11:$FV$11,FB42:FV42)","v":0},{"$f":"IF(FB42=\"xx\",\"xx\",GI42)","v":"xx"},"xx",{"$f":"IF(OR(GJ42=\"xx\",GK42=\"xx\"),\"xx\",GK42+GJ42)","v":"xx"},{"$f":"IF(GL42=\"xx\",99,RANK(GL42,$GL$41:$GL$112))","v":99},null,null,null,null,null,{"$f":"COUNTIF($GM$41:$GM$112,GV42)","v":0},{"$f":"IF(GS42>0,MATCH(GV42,$GM$41:$GM$112,0),\"xx\")","v":"xx"},null,2,null,null,null,"xx",{"$f":"IF($GS42=0,\"xx\",INDEX($CH$41:$DN$112,$GT42,HA$12))","v":"xx"},"xx","xx","xx","xx","xx","xx","xx","xx","xx","xx","xx","xx","xx","xx","xx","xx","xx","xx","xx","xx",null,null,null,null,null,null,null,null,null,null,null,null,"xx"]
[3,"Westerwoldisk rajgræs",null,null,{"$f":"IF('Efterafgrøde beslutningsstøtte'!A$7<>\"Pligtig mellemafgrøde\",HYPERLINK(\"https://dyrk-plant.dlbr.dk/Web/(S(ikevr3oqnx5oe2t5cyfyknyq))/forms/Main.aspx?page=Vejledning&cropID=226\",\"Efterafgrøder\"),HYPERLINK(\"https://dyrk-plant.dlbr.dk/Web/(S(0x3ftyiaahcpttq0ljebuany))/forms/Main.aspx?page=Vejledning&cropID=238\",\"Mellemafgrøder\"))","v":"Efterafgrøder"},"xx","xx","xx","xx","xx","xx","xx","xx","xx","xx","xx","xx","xx","xx","xx","xx","xx","xx","xx","xx","xx","xx","xx",null,null,null,null,null,null,null,null,null,"xx",null,null,null,null,null,null,null,null,null,null,null,null,"xx","xx","xx","xx","xx","xx","xx","xx","xx","xx","xx","xx","xx","xx","xx","xx","xx","xx","xx","xx","xx","xx",null,null,null,null,null,null,null,null,null,null,"xx",null,null,"xx","xx","xx","xx","xx","xx","xx","xx","xx","xx","xx","xx","xx","xx","xx","xx","xx","xx","xx","xx",null,"xx",null,null,null,null,null,null,null,null,null,null,"xx",null,null,null,"xx","xx","xx","xx","xx","xx","xx","xx","xx","xx","xx","xx","xx","xx","xx","xx","xx","xx","xx","xx","xx",null,null,null,null,null,null,null,null,null,null,null,null,null,null,null,"xx","xx","xx","xx","xx","xx","xx","xx","xx","xx","xx","xx","xx","xx","xx","xx","xx","xx","xx","xx","xx",null,null,null,null,null,null,null,null,null,null,null,null,0,"xx","xx","xx",99,null,null,null,null,null,0,{"$f":"IF(GS43>0,MATCH(GV43,$GM$41:$GM$112,0),\"xx\")","v":"xx"},null,3,null,null,null,"xx","xx","xx","xx","xx","xx","xx","xx","xx","xx","xx","xx","xx","xx","xx","xx","xx","xx","xx","xx","xx","xx",null,null,null,null,null,null,null,null,null,null,null,null,"xx"]
[4,"Strandsvingel, udlæg",null,null,{"$f":"IF('Efterafgrøde beslutningsstøtte'!A$7<>\"Pligtig mellemafgrøde\",HYPERLINK(\"https://dyrk-plant.dlbr.dk/Web/(S(ikevr3oqnx5oe2t5cyfyknyq))/forms/Main.aspx?page=Vejledning&cropID=226\",\"Efterafgrøder\"),HYPERLINK(\"https://dyrk-plant.dlbr.dk/Web/(S(0x3ftyiaahcpttq0ljebuany))/forms/Main.aspx?page=Vejledning&cropID=238\",\"Mellemafgrøder\"))","v":"Efterafgrøder"},"xx","xx","xx","xx","xx","xx","xx","xx","xx","xx","xx","xx","xx","xx","xx","xx","xx","xx","xx","xx","xx","xx","xx",null,null,null,null,null,null,null,null,null,"xx",null,null,null,null,null,null,null,null,null,null,null,null,"xx","xx","xx","xx","xx","xx","xx","xx","xx","xx","xx","xx","xx","xx","xx","xx","xx","xx","xx","xx","xx","xx",null,null,null,null,null,null,null,null,null,null,"xx",null,null,"xx","xx","xx","xx","xx","xx","xx","xx","xx","xx","xx","xx","xx","xx","xx","xx","xx","xx","xx","xx",null,"xx",null,null,null,null,null,null,null,null,null,null,"xx",null,null,null,"xx","xx","xx","xx","xx","xx","xx","xx","xx","xx","xx","xx","xx","xx","xx","xx","xx","xx","xx","xx","xx",null,null,null,null,null,null,null,null,null,null,null,null,null,null,null,"xx","xx","xx","xx","xx","xx","xx","xx","xx","xx","xx","xx","xx","xx","xx","xx","xx","xx","xx","xx","xx",null,null,null,null,null,null,null,null,null,null,null,null,0,"xx","xx","xx",99,null,null,null,null,null,{"$f":"COUNTIF($GM$41:$GM$112,GV44)","v":0},{"$f":"IF(GS44>0,MATCH(GV44,$GM$41:$GM$112,0),\"xx\")","v":"xx"},null,4,null,null,null,"xx","xx","xx","xx","xx","xx","xx","xx","xx","xx","xx","xx","xx","xx","xx","xx","xx","xx","xx","xx","xx","xx",null,null,null,null,null,null,null,null,null,null,null,null,"xx"]
[5,"Rødsvingel, udlæg",null,null,{"$f":"IF('Efterafgrøde beslutningsstøtte'!A$7<>\"Pligtig mellemafgrøde\",HYPERLINK(\"https://dyrk-plant.dlbr.dk/Web/(S(ikevr3oqnx5oe2t5cyfyknyq))/forms/Main.aspx?page=Vejledning&cropID=226\",\"Efterafgrøder\"),HYPERLINK(\"https://dyrk-plant.dlbr.dk/Web/(S(0x3ftyiaahcpttq0ljebuany))/forms/Main.aspx?page=Vejledning&cropID=238\",\"Mellemafgrøder\"))","v":"Efterafgrøder"},"xx","xx","xx","xx","xx","xx","xx","xx","xx","xx","xx","xx","xx","xx","xx","xx","xx","xx","xx","xx","xx","xx","xx",null,null,null,null,null,null,null,null,null,"xx",null,null,null,null,null,null,null,null,null,null,null,null,"xx","xx","xx","xx","xx","xx","xx","xx","xx","xx","xx","xx","xx","xx","xx","xx","xx","xx","xx","xx","xx","xx",null,null,null,null,null,null,null,null,null,null,"xx",null,null,"xx","xx","xx","xx","xx","xx","xx","xx","xx","xx","xx","xx","xx","xx","xx","xx","xx","xx","xx","xx",null,"xx",null,null,null,null,null,null,null,null,null,null,"xx",null,null,null,"xx","xx","xx","xx","xx","xx","xx","xx","xx","xx","xx","xx","xx","xx","xx","xx","xx","xx","xx","xx","xx",null,null,null,null,null,null,null,null,null,null,null,null,null,null,null,"xx","xx","xx","xx","xx","xx","xx","xx","xx","xx","xx","xx","xx","xx","xx","xx","xx","xx","xx","xx","xx",null,null,null,null,null,null,null,null,null,null,null,null,0,"xx","xx","xx",99,null,null,null,null,null,0,"xx",null,5,null,null,null,"xx","xx","xx","xx","xx","xx","xx","xx","xx","xx","xx","xx","xx","xx","xx","xx","xx","xx","xx","xx","xx","xx",null,null,null,null,null,null,null,null,null,null,null,null,"xx"]
[6,"Engrapgræs, udlæg",null,null,{"$f":"IF('Efterafgrøde beslutningsstøtte'!A$7<>\"Pligtig mellemafgrøde\",HYPERLINK(\"https://dyrk-plant.dlbr.dk/Web/(S(ikevr3oqnx5oe2t5cyfyknyq))/forms/Main.aspx?page=Vejledning&cropID=226\",\"Efterafgrøder\"),HYPERLINK(\"https://dyrk-plant.dlbr.dk/Web/(S(0x3ftyiaahcpttq0ljebuany))/forms/Main.aspx?page=Vejledning&cropID=238\",\"Mellemafgrøder\"))","v":"Efterafgrøder"},"xx","xx","xx","xx","xx","xx","xx","xx","xx","xx","xx","xx","xx","xx","xx","xx","xx","xx","xx","xx","xx","xx","xx",null,null,null,null,null,null,null,null,null,"xx",null,null,null,null,null,null,null,null,null,null,null,null,"xx","xx","xx","xx","xx","xx","xx","xx","xx","xx","xx","xx","xx","xx","xx","xx","xx","xx","xx","xx","xx","xx",null,null,null,null,null,null,null,null,null,null,"xx",null,null,"xx","xx","xx","xx","xx","xx","xx","xx","xx","xx","xx","xx","xx","xx","xx","xx","xx","xx","xx","xx",null,"xx",null,null,null,null,null,null,null,null,null,null,"xx",null,null,null,"xx","xx","xx","xx","xx","xx","xx","xx","xx","xx","xx","xx","xx","xx","xx","xx","xx","xx","xx","xx","xx",null,null,null,null,null,null,null,null,null,null,null,null,null,null,null,"xx","xx","xx","xx","xx","xx","xx","xx","xx","xx","xx","xx","xx","xx","xx","xx","xx","xx","xx","xx","xx",null,null,null,null,null,null,null,null,null,null,null,null,0,"xx","xx","xx",99,null,null,null,null,null,0,"xx",null,6,null,null,null,"xx","xx","xx","xx","xx","xx","xx","xx","xx","xx","xx","xx","xx","xx","xx","xx","xx","xx","xx","xx","xx","xx",null,null,null,null,null,null,null,null,null,null,null,null,"xx"]
[7,"Hundegræs, udlæg",null,null,{"$f":"IF('Efterafgrøde beslutningsstøtte'!A$7<>\"Pligtig mellemafgrøde\",HYPERLINK(\"https://dyrk-plant.dlbr.dk/Web/(S(ikevr3oqnx5oe2t5cyfyknyq))/forms/Main.aspx?page=Vejledning&cropID=226\",\"Efterafgrøder\"),HYPERLINK(\"https://dyrk-plant.dlbr.dk/Web/(S(0x3ftyiaahcpttq0ljebuany))/forms/Main.aspx?page=Vejledning&cropID=238\",\"Mellemafgrøder\"))","v":"Efterafgrøder"},"xx","xx","xx","xx","xx","xx","xx","xx","xx","xx","xx","xx","xx","xx","xx","xx","xx","xx","xx","xx","xx","xx","xx",null,null,null,null,null,null,null,null,null,"xx",null,null,null,null,null,null,null,null,null,null,null,null,"xx","xx","xx","xx","xx","xx","xx","xx","xx","xx","xx","xx","xx","xx","xx","xx","xx","xx","xx","xx","xx","xx",null,null,null,null,null,null,null,null,null,null,"xx",null,null,"xx","xx","xx","xx","xx","xx","xx","xx","xx","xx","xx","xx","xx","xx","xx","xx","xx","xx","xx","xx",null,"xx",null,null,null,null,null,null,null,null,null,null,"xx",null,null,null,"xx","xx","xx","xx","xx","xx","xx","xx","xx","xx","xx","xx","xx","xx","xx","xx","xx","xx","xx","xx","xx",null,null,null,null,null,null,null,null,null,null,null,null,null,null,null,"xx","xx","xx","xx","xx","xx","xx","xx","xx","xx","xx","xx","xx","xx","xx","xx","xx","xx","xx","xx","xx",null,null,null,null,null,null,null,null,null,null,null,null,0,"xx","xx","xx",99,null,null,null,null,null,0,"xx",null,7,null,null,null,"xx","xx","xx","xx","xx","xx","xx","xx","xx","xx","xx","xx","xx","xx","xx","xx","xx","xx","xx","xx","xx","xx",null,null,null,null,null,null,null,null,null,null,null,null,"xx"]
[8,"Frøgræs, udtjent",null,null,{"$f":"IF('Efterafgrøde beslutningsstøtte'!A$7<>\"Pligtig mellemafgrøde\",HYPERLINK(\"https://dyrk-plant.dlbr.dk/Web/(S(ikevr3oqnx5oe2t5cyfyknyq))/forms/Main.aspx?page=Vejledning&cropID=226\",\"Efterafgrøder\"),HYPERLINK(\"https://dyrk-plant.dlbr.dk/Web/(S(0x3ftyiaahcpttq0ljebuany))/forms/Main.aspx?page=Vejledning&cropID=238\",\"Mellemafgrøder\"))","v":"Efterafgrøder"},"xx","xx","xx","xx","xx","xx","xx","xx","xx","xx","xx","xx","xx","xx","xx","xx","xx","xx","xx","xx","xx","xx","xx",null,null,null,null,null,null,null,null,null,"xx",null,null,null,null,null,null,null,null,null,null,null,null,"xx","xx","xx","xx","xx","xx","xx","xx","xx","xx","xx","xx","xx","xx","xx","xx","xx","xx","xx","xx","xx","xx",null,null,null,null,null,null,null,null,null,null,"xx",null,null,"xx","xx","xx","xx","xx","xx","xx","xx","xx","xx","xx","xx","xx","xx","xx","xx","xx","xx","xx","xx",null,"xx",null,null,null,null,null,null,null,null,null,null,"xx",null,null,null,"xx","xx","xx","xx","xx","xx","xx","xx","xx","xx","xx","xx","xx","xx","xx","xx","xx","xx","xx","xx","xx",null,null,null,null,null,null,null,null,null,null,null,null,null,null,null,"xx","xx","xx","xx","xx","xx","xx","xx","xx","xx","xx","xx","xx","xx","xx","xx","xx","xx","xx","xx","xx",null,null,null,null,null,null,null,null,null,null,null,null,0,"xx","xx","xx",99,null,null,null,null,null,0,"xx",null,8,null,null,null,"xx","xx","xx","xx","xx","xx","xx","xx","xx","xx","xx","xx","xx","xx","xx","xx","xx","xx","xx","xx","xx","xx",null,null,null,null,null,null,null,null,null,null,null,null,"xx"]
[9,"Gul sennep",null,null,{"$f":"IF('Efterafgrøde beslutningsstøtte'!A$7<>\"Pligtig mellemafgrøde\",HYPERLINK(\"https://dyrk-plant.dlbr.dk/Web/(S(ikevr3oqnx5oe2t5cyfyknyq))/forms/Main.aspx?page=Vejledning&cropID=226\",\"Efterafgrøder\"),HYPERLINK(\"https://dyrk-plant.dlbr.dk/Web/(S(0x3ftyiaahcpttq0ljebuany))/forms/Main.aspx?page=Vejledning&cropID=238\",\"Mellemafgrøder\"))","v":"Efterafgrøder"},"xx","xx","xx","xx","xx","xx","xx","xx","xx","xx","xx","xx","xx","xx","xx","xx","xx","xx","xx","xx","xx","xx","xx",null,null,null,null,null,null,null,null,null,"xx",null,null,null,null,null,null,null,null,null,null,null,null,"xx","xx","xx","xx","xx","xx","xx","xx","xx","xx","xx","xx","xx","xx","xx","xx","xx","xx","xx","xx","xx","xx",null,null,null,null,null,null,null,null,null,null,"xx",null,null,"xx","xx","xx","xx","xx","xx","xx","xx","xx","xx","xx","xx","xx","xx","xx","xx","xx","xx","xx","xx",null,"xx",null,null,null,null,null,null,null,null,null,null,"xx",null,null,null,"xx","xx","xx","xx","xx","xx","xx","xx","xx","xx","xx","xx","xx","xx","xx","xx","xx","xx","xx","xx","xx",null,null,null,null,null,null,null,null,null,null,null,null,null,null,null,"xx","xx","xx","xx","xx","xx","xx","xx","xx","xx","xx","xx","xx","xx","xx","xx","xx","xx","xx","xx","xx",null,null,null,null,null,null,null,null,null,null,null,null,0,"xx","xx","xx",99,null,null,null,null,null,0,"xx",null,9,null,null,null,"xx","xx","xx","xx","xx","xx","xx","xx","xx","xx","xx","xx","xx","xx","xx","xx","xx","xx","xx","xx","xx","xx",null,null,null,null,null,null,null,null,null,null,null,null,"xx"]
[10,"Olieræddike",null,null,{"$f":"IF('Efterafgrøde beslutningsstøtte'!A$7<>\"Pligtig mellemafgrøde\",HYPERLINK(\"https://dyrk-plant.dlbr.dk/Web/(S(ikevr3oqnx5oe2t5cyfyknyq))/forms/Main.aspx?page=Vejledning&cropID=226\",\"Efterafgrøder\"),HYPERLINK(\"https://dyrk-plant.dlbr.dk/Web/(S(0x3ftyiaahcpttq0ljebuany))/forms/Main.aspx?page=Vejledning&cropID=238\",\"Mellemafgrøder\"))","v":"Efterafgrøder"},"xx","xx","xx","xx","xx","xx","xx","xx","xx","xx","xx","xx","xx","xx","xx","xx","xx","xx","xx","xx","xx","xx","xx",null,null,null,null,null,null,null,null,null,"xx",null,null,null,null,null,null,null,null,null,null,null,null,"xx","xx","xx","xx","xx","xx","xx","xx","xx","xx","xx","xx","xx","xx","xx","xx","xx","xx","xx","xx","xx","xx",null,null,null,null,null,null,null,null,null,null,"xx",null,null,"xx","xx","xx","xx","xx","xx","xx","xx","xx","xx","xx","xx","xx","xx","xx","xx","xx","xx","xx","xx",null,"xx",null,null,null,null,null,null,null,null,null,null,"xx",null,null,null,"xx","xx","xx","xx","xx","xx","xx","xx","xx","xx","xx","xx","xx","xx","xx","xx","xx","xx","xx","xx","xx",null,null,null,null,null,null,null,null,null,null,null,null,null,null,null,"xx","xx","xx","xx","xx","xx","xx","xx","xx","xx","xx","xx","xx","xx","xx","xx","xx","xx","xx","xx","xx",null,null,null,null,null,null,null,null,null,null,null,null,0,"xx","xx","xx",99,null,null,null,null,null,0,"xx",null,10,null,null,null,"xx","xx","xx","xx","xx","xx","xx","xx","xx","xx","xx","xx","xx","xx","xx","xx","xx","xx","xx","xx","xx","xx",null,null,null,null,null,null,null,null,null,null,null,null,"xx"]
[11,"Vinterraps, hybrid",null,null,{"$f":"IF('Efterafgrøde beslutningsstøtte'!A$7<>\"Pligtig mellemafgrøde\",HYPERLINK(\"https://dyrk-plant.dlbr.dk/Web/(S(ikevr3oqnx5oe2t5cyfyknyq))/forms/Main.aspx?page=Vejledning&cropID=226\",\"Efterafgrøder\"),HYPERLINK(\"https://dyrk-plant.dlbr.dk/Web/(S(0x3ftyiaahcpttq0ljebuany))/forms/Main.aspx?page=Vejledning&cropID=238\",\"Mellemafgrøder\"))","v":"Efterafgrøder"},{"$f":"VLOOKUP($A51,Karaktermatrice,F$38,FALSE)","v":"xx"},"xx","xx","xx","xx","xx","xx","xx","xx","xx",{"$f":"VLOOKUP($A51,Karaktermatrice,P$38,FALSE)","v":"xx"},"xx","xx","xx","xx","xx","xx","xx","xx","xx","xx","xx","xx",null,null,null,null,null,null,null,null,null,"xx",null,null,null,null,null,null,null,null,null,null,null,null,"xx","xx","xx","xx","xx","xx","xx","xx","xx","xx","xx","xx","xx","xx","xx","xx","xx","xx","xx","xx","xx","xx",null,null,null,null,null,null,null,null,null,null,"xx",null,null,"xx","xx","xx","xx","xx","xx","xx","xx","xx","xx","xx","xx","xx","xx","xx","xx","xx","xx","xx","xx",null,"xx",null,null,null,null,null,null,null,null,null,null,"xx",null,null,null,"xx","xx","xx","xx","xx","xx","xx","xx","xx","xx","xx","xx","xx","xx","xx","xx","xx","xx","xx","xx","xx",null,null,null,null,null,null,null,null,null,null,null,null,null,null,null,"xx","xx","xx","xx","xx","xx","xx","xx","xx","xx","xx","xx","xx","xx","xx","xx","xx","xx","xx","xx","xx",null,null,null,null,null,null,null,null,null,null,null,null,0,"xx","xx","xx",99,null,null,null,null,null,0,"xx",null,11,null,null,null,"xx","xx","xx","xx","xx","xx","xx","xx","xx","xx","xx","xx","xx","xx","xx","xx","xx","xx","xx","xx","xx","xx",null,null,null,null,null,null,null,null,null,null,null,null,"xx"]
[12,"Vinterraps , linie",null,null,{"$f":"IF('Efterafgrøde beslutningsstøtte'!A$7<>\"Pligtig mellemafgrøde\",HYPERLINK(\"https://dyrk-plant.dlbr.dk/Web/(S(ikevr3oqnx5oe2t5cyfyknyq))/forms/Main.aspx?page=Vejledning&cropID=226\",\"Efterafgrøder\"),HYPERLINK(\"https://dyrk-plant.dlbr.dk/Web/(S(0x3ftyiaahcpttq0ljebuany))/forms/Main.aspx?page=Vejledning&cropID=238\",\"Mellemafgrøder\"))","v":"Efterafgrøder"},"xx","xx","xx","xx","xx","xx","xx","xx","xx","xx","xx","xx","xx","xx","xx","xx","xx","xx","xx","xx","xx","xx","xx",null,null,null,null,null,null,null,null,null,"xx",null,null,null,null,null,null,null,null,null,null,null,null,"xx","xx","xx","xx","xx","xx","xx","xx","xx","xx","xx","xx","xx","xx","xx","xx","xx","xx","xx","xx","xx","xx",null,null,null,null,null,null,null,null,null,null,"xx",null,null,"xx","xx","xx","xx","xx","xx","xx","xx","xx","xx","xx","xx","xx","xx","xx","xx","xx","xx","xx","xx",null,"xx",null,null,null,null,null,null,null,null,null,null,"xx",null,null,null,"xx","xx","xx","xx","xx","xx","xx","xx","xx","xx","xx","xx","xx","xx","xx","xx","xx","xx","xx","xx","xx",null,null,null,null,null,null,null,null,null,null,null,null,null,null,null,"xx","xx","xx","xx","xx","xx","xx","xx","xx","xx","xx","xx","xx","xx","xx","xx","xx","xx","xx","xx","xx",null,null,null,null,null,null,null,null,null,null,null,null,0,"xx","xx","xx",99,null,null,null,null,null,0,"xx",null,12,null,null,null,"xx","xx","xx","xx","xx","xx","xx","xx","xx","xx","xx","xx","xx","xx","xx","xx","xx","xx","xx","xx","xx","xx",null,null,null,null,null,null,null,null,null,null,null,null,"xx"]
[13,"Foderradise (Strukturator)",null,null,{"$f":"IF('Efterafgrøde beslutningsstøtte'!A$7<>\"Pligtig mellemafgrøde\",HYPERLINK(\"https://dyrk-plant.dlbr.dk/Web/(S(ikevr3oqnx5oe2t5cyfyknyq))/forms/Main.aspx?page=Vejledning&cropID=226\",\"Efterafgrøder\"),HYPERLINK(\"https://dyrk-plant.dlbr.dk/Web/(S(0x3ftyiaahcpttq0ljebuany))/forms/Main.aspx?page=Vejledning&cropID=238\",\"Mellemafgrøder\"))","v":"Efterafgrøder"},"xx","xx","xx","xx","xx","xx","xx","xx","xx","xx","xx","xx","xx","xx","xx","xx","xx","xx","xx","xx","xx","xx","xx",null,null,null,null,null,null,null,null,null,"xx",null,null,null,null,null,null,null,null,null,null,null,null,"xx","xx","xx","xx",{"$f":"J53","v":"xx"},"xx","xx","xx","xx","xx","xx","xx","xx","xx","xx","xx","xx","xx","xx","xx","xx","xx",null,null,null,null,null,null,null,null,null,null,"xx",null,null,"xx","xx","xx","xx","xx","xx","xx","xx","xx","xx","xx","xx","xx","xx","xx","xx","xx","xx","xx","xx",null,"xx",null,null,null,null,null,null,null,null,null,null,"xx",null,null,null,"xx","xx","xx","xx","xx","xx","xx","xx","xx","xx","xx","xx","xx","xx","xx","xx","xx","xx","xx","xx","xx",null,null,null,null,null,null,null,null,null,null,null,null,null,null,null,"xx","xx","xx","xx","xx","xx","xx","xx","xx","xx","xx","xx","xx","xx","xx","xx","xx","xx","xx","xx","xx",null,null,null,null,null,null,null,null,null,null,null,null,0,"xx","xx","xx",99,null,null,null,null,null,0,"xx",null,13,null,null,null,"xx","xx","xx","xx","xx",{"$f":"IF($GS53=0,\"xx\",INDEX($CH$41:$DN$112,$GT53,HE$12))","v":"xx"},"xx","xx","xx","xx","xx","xx","xx","xx","xx","xx","xx","xx","xx","xx","xx",{"$f":"IF($GS53=0,\"xx\",INDEX($CH$41:$DN$112,$GT53,HU$12))","v":"xx"},null,null,null,null,null,null,null,null,null,null,null,null,"xx"]
[14,"Havre, sået inden 1. august",null,null,{"$f":"IF('Efterafgrøde beslutningsstøtte'!A$7<>\"Pligtig mellemafgrøde\",HYPERLINK(\"https://dyrk-plant.dlbr.dk/Web/(S(ikevr3oqnx5oe2t5cyfyknyq))/forms/Main.aspx?page=Vejledning&cropID=226\",\"Efterafgrøder\"),HYPERLINK(\"https://dyrk-plant.dlbr.dk/Web/(S(0x3ftyiaahcpttq0ljebuany))/forms/Main.aspx?page=Vejledning&cropID=238\",\"Mellemafgrøder\"))","v":"Efterafgrøder"},"xx","xx","xx","xx","xx","xx","xx","xx","xx","xx","xx","xx","xx","xx","xx","xx","xx","xx","xx","xx","xx","xx","xx",null,null,null,null,null,null,null,null,null,"xx",null,null,null,null,null,null,null,null,null,null,null,null,"xx",{"$f":"G54","v":"xx"},"xx","xx","xx","xx","xx","xx","xx","xx","xx","xx","xx","xx","xx","xx","xx","xx","xx","xx","xx","xx",null,null,null,null,null,null,null,null,null,null,"xx",null,null,"xx","xx","xx","xx","xx","xx","xx","xx","xx","xx","xx","xx","xx","xx","xx","xx","xx","xx","xx","xx",null,"xx",null,null,null,null,null,null,null,null,null,null,"xx",null,null,null,"xx","xx","xx","xx","xx","xx","xx","xx","xx","xx","xx","xx","xx","xx","xx","xx","xx","xx","xx","xx","xx",null,null,null,null,null,null,null,null,null,null,null,null,null,null,null,"xx","xx","xx","xx","xx","xx","xx","xx","xx","xx","xx","xx","xx","xx","xx","xx","xx","xx","xx","xx","xx",null,null,null,null,null,null,null,null,null,null,null,null,0,"xx","xx","xx",99,null,null,null,null,null,0,"xx",null,14,null,null,null,"xx","xx","xx","xx","xx","xx","xx","xx","xx","xx","xx","xx","xx","xx","xx","xx","xx","xx","xx","xx","xx","xx",null,null,null,null,null,null,null,null,null,null,null,null,"xx"]
[15,"Havre, sået mellem 1. og 20. august",null,null,{"$f":"IF('Efterafgrøde beslutningsstøtte'!A$7<>\"Pligtig mellemafgrøde\",HYPERLINK(\"https://dyrk-plant.dlbr.dk/Web/(S(ikevr3oqnx5oe2t5cyfyknyq))/forms/Main.aspx?page=Vejledning&cropID=226\",\"Efterafgrøder\"),HYPERLINK(\"https://dyrk-plant.dlbr.dk/Web/(S(0x3ftyiaahcpttq0ljebuany))/forms/Main.aspx?page=Vejledning&cropID=238\",\"Mellemafgrøder\"))","v":"Efterafgrøder"},"xx","xx","xx","xx","xx","xx","xx","xx","xx","xx","xx","xx","xx","xx","xx","xx","xx","xx","xx","xx","xx","xx","xx",null,null,null,null,null,null,null,null,null,"xx",null,null,null,null,null,null,null,null,null,null,null,null,"xx","xx","xx","xx","xx","xx","xx","xx","xx","xx","xx","xx","xx","xx","xx","xx","xx","xx","xx","xx","xx","xx",null,null,null,null,null,null,null,null,null,null,"xx",null,null,"xx","xx","xx","xx","xx","xx","xx","xx","xx","xx","xx","xx","xx","xx","xx","xx","xx","xx","xx","xx",null,"xx",null,null,null,null,null,null,null,null,null,null,"xx",null,null,null,"xx","xx","xx","xx","xx","xx","xx","xx","xx","xx","xx","xx","xx","xx","xx","xx","xx","xx","xx","xx","xx",null,null,null,null,null,null,null,null,null,null,null,null,null,null,null,"xx","xx","xx","xx","xx","xx","xx","xx","xx","xx","xx","xx","xx","xx","xx","xx","xx","xx","xx","xx","xx",null,null,null,null,null,null,null,null,null,null,null,null,0,"xx","xx",{"$f":"IF(OR(GJ55=\"xx\",GK55=\"xx\"),\"xx\",GK55+GJ55)","v":"xx"},99,null,null,null,null,null,0,"xx",null,15,null,null,null,"xx","xx","xx","xx","xx","xx","xx","xx","xx","xx","xx","xx","xx","xx","xx","xx","xx","xx","xx","xx","xx","xx",null,null,null,null,null,null,null,null,null,null,null,null,"xx"]
[16,"Stauderug, sået inden 1. august",null,null,{"$f":"IF('Efterafgrøde beslutningsstøtte'!A$7<>\"Pligtig mellemafgrøde\",HYPERLINK(\"https://dyrk-plant.dlbr.dk/Web/(S(ikevr3oqnx5oe2t5cyfyknyq))/forms/Main.aspx?page=Vejledning&cropID=226\",\"Efterafgrøder\"),HYPERLINK(\"https://dyrk-plant.dlbr.dk/Web/(S(0x3ftyiaahcpttq0ljebuany))/forms/Main.aspx?page=Vejledning&cropID=238\",\"Mellemafgrøder\"))","v":"Efterafgrøder"},"xx","xx","xx","xx","xx","xx","xx","xx","xx","xx","xx","xx","xx","xx","xx","xx","xx","xx","xx","xx","xx","xx","xx",null,null,null,null,null,null,null,null,null,"xx",null,null,null,null,null,null,null,null,null,null,null,null,"xx","xx","xx","xx","xx","xx","xx","xx","xx","xx","xx","xx","xx","xx","xx","xx","xx","xx","xx","xx","xx","xx",null,null,null,null,null,null,null,null,null,null,"xx",null,null,"xx","xx","xx","xx","xx","xx","xx","xx","xx","xx","xx","xx","xx","xx","xx","xx","xx","xx","xx","xx",null,"xx",null,null,null,null,null,null,null,null,null,null,"xx",null,null,null,"xx","xx","xx","xx","xx","xx","xx","xx","xx","xx","xx","xx","xx","xx","xx","xx","xx","xx","xx","xx","xx",null,null,null,null,null,null,null,null,null,null,null,null,null,null,null,"xx","xx","xx","xx","xx","xx","xx","xx","xx","xx","xx","xx","xx","xx","xx","xx","xx","xx","xx","xx","xx",null,null,null,null,null,null,null,null,null,null,null,null,0,"xx","xx","xx",99,null,null,null,null,null,0,"xx",null,16,null,null,null,"xx","xx","xx","xx","xx","xx","xx","xx","xx","xx","xx","xx","xx","xx","xx","xx","xx","xx","xx","xx","xx","xx",null,null,null,null,null,null,null,null,null,null,null,null,"xx"]
[17,"Stauderug, sået mellem 1. og 20. august",null,null,{"$f":"IF('Efterafgrøde beslutningsstøtte'!A$7<>\"Pligtig mellemafgrøde\",HYPERLINK(\"https://dyrk-plant.dlbr.dk/Web/(S(ikevr3oqnx5oe2t5cyfyknyq))/forms/Main.aspx?page=Vejledning&cropID=226\",\"Efterafgrøder\"),HYPERLINK(\"https://dyrk-plant.dlbr.dk/Web/(S(0x3ftyiaahcpttq0ljebuany))/forms/Main.aspx?page=Vejledning&cropID=238\",\"Mellemafgrøder\"))","v":"Efterafgrøder"},"xx","xx","xx","xx","xx","xx","xx","xx","xx","xx","xx","xx","xx","xx","xx","xx","xx","xx","xx","xx","xx","xx","xx",null,null,null,null,null,null,null,null,null,"xx",null,null,null,null,null,null,null,null,null,null,null,null,"xx","xx","xx","xx","xx","xx","xx","xx","xx","xx","xx","xx","xx","xx","xx","xx","xx","xx","xx",{"$f":"Z57","v":"xx"},{"$f":"AA57","v":"xx"},{"$f":"AB57","v":"xx"},null,null,null,null,null,null,null,null,null,null,"xx",null,null,"xx","xx","xx","xx","xx","xx","xx","xx","xx","xx","xx","xx","xx","xx","xx","xx","xx","xx","xx","xx",null,"xx",null,null,null,null,null,null,null,null,null,null,"xx",null,null,null,"xx","xx","xx","xx","xx","xx","xx","xx","xx","xx","xx","xx","xx","xx","xx","xx","xx","xx","xx","xx","xx",null,null,null,null,null,null,null,null,null,null,null,null,null,null,null,"xx","xx","xx","xx","xx","xx","xx","xx","xx","xx","xx","xx","xx","xx","xx","xx","xx","xx","xx","xx","xx",null,null,null,null,null,null,null,null,null,null,null,null,0,"xx","xx","xx",99,null,null,null,null,null,{"$f":"COUNTIF($GM$41:$GM$112,GV57)","v":0},"xx",null,17,null,null,null,"xx","xx","xx","xx","xx","xx","xx","xx","xx","xx","xx","xx","xx","xx","xx","xx","xx","xx","xx","xx","xx","xx",null,null,null,null,null,null,null,null,null,null,null,null,"xx"]
[18,"Vårbyg, sået inden 1. august",null,null,{"$f":"IF('Efterafgrøde beslutningsstøtte'!A$7<>\"Pligtig mellemafgrøde\",HYPERLINK(\"https://dyrk-plant.dlbr.dk/Web/(S(ikevr3oqnx5oe2t5cyfyknyq))/forms/Main.aspx?page=Vejledning&cropID=226\",\"Efterafgrøder\"),HYPERLINK(\"https://dyrk-plant.dlbr.dk/Web/(S(0x3ftyiaahcpttq0ljebuany))/forms/Main.aspx?page=Vejledning&cropID=238\",\"Mellemafgrøder\"))","v":"Efterafgrøder"},"xx","xx","xx","xx","xx","xx","xx","xx","xx","xx","xx","xx","xx","xx","xx","xx","xx","xx","xx","xx","xx","xx","xx",null,null,null,null,null,null,null,null,null,"xx",null,null,null,null,null,null,null,null,null,null,null,null,"xx","xx","xx","xx","xx","xx","xx","xx","xx","xx","xx","xx","xx","xx","xx","xx","xx","xx","xx","xx","xx","xx",null,null,null,null,null,null,null,null,null,null,"xx",null,null,"xx","xx","xx","xx","xx","xx","xx","xx","xx","xx","xx","xx","xx","xx","xx","xx","xx","xx","xx","xx",null,"xx",null,null,null,null,null,null,null,null,null,null,"xx",null,null,null,"xx","xx","xx","xx","xx","xx","xx","xx","xx","xx","xx","xx","xx","xx","xx","xx","xx","xx","xx","xx","xx",null,null,null,null,null,null,null,null,null,null,null,null,null,null,null,"xx","xx","xx","xx","xx","xx","xx","xx","xx","xx","xx","xx","xx","xx","xx","xx","xx","xx","xx","xx","xx",null,null,null,null,null,null,null,null,null,null,null,null,0,"xx","xx","xx",99,null,null,null,null,null,0,"xx",null,18,null,null,null,"xx","xx","xx","xx","xx","xx","xx","xx","xx","xx","xx","xx","xx","xx","xx","xx","xx","xx","xx","xx","xx","xx",null,null,null,null,null,null,null,null,null,null,null,null,"xx"]
[19,"Vårbyg, sået mellem 1. og 20. august",null,null,{"$f":"IF('Efterafgrøde beslutningsstøtte'!A$7<>\"Pligtig mellemafgrøde\",HYPERLINK(\"https://dyrk-plant.dlbr.dk/Web/(S(ikevr3oqnx5oe2t5cyfyknyq))/forms/Main.aspx?page=Vejledning&cropID=226\",\"Efterafgrøder\"),HYPERLINK(\"https://dyrk-plant.dlbr.dk/Web/(S(0x3ftyiaahcpttq0ljebuany))/forms/Main.aspx?page=Vejledning&cropID=238\",\"Mellemafgrøder\"))","v":"Efterafgrøder"},"xx","xx","xx","xx","xx","xx","xx","xx","xx","xx","xx","xx","xx","xx","xx","xx","xx","xx","xx","xx","xx","xx","xx",null,null,null,null,null,null,null,null,null,"xx",null,null,null,null,null,null,null,null,null,null,null,null,"xx","xx","xx","xx","xx","xx","xx","xx","xx","xx","xx","xx","xx","xx","xx","xx","xx","xx","xx","xx","xx","xx",null,null,null,null,null,null,null,null,null,null,"xx",null,null,"xx","xx","xx","xx","xx","xx","xx","xx","xx","xx","xx","xx","xx","xx","xx","xx","xx","xx","xx","xx",null,"xx",null,null,null,null,null,null,null,null,null,null,"xx",null,null,null,"xx","xx","xx","xx","xx","xx","xx","xx","xx","xx","xx","xx","xx","xx","xx","xx","xx","xx","xx","xx","xx",null,null,null,null,null,null,null,null,null,null,null,null,null,null,null,"xx","xx","xx","xx","xx","xx","xx","xx","xx","xx","xx","xx","xx","xx","xx","xx","xx","xx","xx","xx","xx",null,null,null,null,null,null,null,null,null,null,null,null,0,"xx","xx","xx",99,null,null,null,null,null,0,"xx",null,19,null,null,null,"xx","xx","xx","xx","xx","xx","xx","xx","xx","xx","xx","xx","xx","xx","xx","xx","xx","xx","xx","xx","xx","xx",null,null,null,null,null,null,null,null,null,null,null,null,"xx"]
[20,"Vinterrug (population), sået inden 1. august",null,null,{"$f":"IF('Efterafgrøde beslutningsstøtte'!A$7<>\"Pligtig mellemafgrøde\",HYPERLINK(\"https://dyrk-plant.dlbr.dk/Web/(S(ikevr3oqnx5oe2t5cyfyknyq))/forms/Main.aspx?page=Vejledning&cropID=226\",\"Efterafgrøder\"),HYPERLINK(\"https://dyrk-plant.dlbr.dk/Web/(S(0x3ftyiaahcpttq0ljebuany))/forms/Main.aspx?page=Vejledning&cropID=238\",\"Mellemafgrøder\"))","v":"Efterafgrøder"},"xx","xx","xx","xx","xx","xx","xx","xx","xx","xx","xx","xx","xx","xx","xx","xx","xx","xx","xx","xx","xx","xx","xx",null,null,null,null,null,null,null,null,null,"xx",null,null,null,null,null,null,null,null,null,null,null,null,"xx","xx","xx","xx","xx","xx","xx","xx","xx","xx","xx","xx","xx","xx","xx","xx","xx","xx","xx","xx","xx","xx",null,null,null,null,null,null,null,null,null,null,"xx",null,null,"xx","xx","xx","xx","xx","xx","xx","xx","xx","xx","xx","xx","xx","xx","xx","xx","xx","xx","xx","xx",null,"xx",null,null,null,null,null,null,null,null,null,null,"xx",null,null,null,"xx","xx","xx","xx","xx","xx","xx","xx","xx","xx","xx","xx","xx","xx","xx","xx","xx","xx","xx","xx","xx",null,null,null,null,null,null,null,null,null,null,null,null,null,null,null,"xx","xx","xx","xx","xx","xx","xx","xx","xx","xx","xx","xx","xx","xx","xx","xx","xx","xx","xx","xx","xx",null,null,null,null,null,null,null,null,null,null,null,null,0,"xx","xx","xx",99,null,null,null,null,null,0,{"$f":"IF(GS60>0,MATCH(GV60,$GM$41:$GM$112,0),\"xx\")","v":"xx"},null,20,null,null,null,"xx","xx","xx","xx","xx","xx","xx","xx","xx","xx","xx","xx","xx","xx","xx","xx","xx","xx","xx","xx","xx","xx",null,null,null,null,null,null,null,null,null,null,null,null,"xx"]
[21,"Vinterrug (population), sået inden 20. august",null,null,{"$f":"IF('Efterafgrøde beslutningsstøtte'!A$7<>\"Pligtig mellemafgrøde\",HYPERLINK(\"https://dyrk-plant.dlbr.dk/Web/(S(ikevr3oqnx5oe2t5cyfyknyq))/forms/Main.aspx?page=Vejledning&cropID=226\",\"Efterafgrøder\"),HYPERLINK(\"https://dyrk-plant.dlbr.dk/Web/(S(0x3ftyiaahcpttq0ljebuany))/forms/Main.aspx?page=Vejledning&cropID=238\",\"Mellemafgrøder\"))","v":"Efterafgrøder"},{"$f":"VLOOKUP($A61,Karaktermatrice,F$38,FALSE)","v":"xx"},"xx","xx","xx","xx","xx","xx","xx","xx","xx",{"$f":"VLOOKUP($A61,Karaktermatrice,P$38,FALSE)","v":"xx"},"xx","xx","xx","xx","xx","xx","xx","xx","xx","xx","xx","xx",null,null,null,null,null,null,null,null,null,"xx",null,null,null,null,null,null,null,null,null,null,null,null,"xx","xx","xx","xx","xx","xx","xx","xx","xx","xx","xx","xx","xx","xx","xx","xx","xx","xx","xx","xx","xx","xx",null,null,null,null,null,null,null,null,null,null,"xx",null,null,"xx","xx","xx","xx","xx","xx","xx","xx","xx","xx","xx","xx","xx","xx","xx","xx","xx","xx","xx","xx",null,"xx",null,null,null,null,null,null,null,null,null,null,"xx",null,null,null,"xx","xx","xx","xx","xx","xx","xx","xx","xx","xx","xx","xx","xx","xx","xx","xx","xx","xx","xx","xx","xx",null,null,null,null,null,null,null,null,null,null,null,null,null,null,null,"xx","xx","xx","xx","xx","xx","xx","xx","xx","xx","xx","xx","xx","xx","xx","xx","xx","xx","xx","xx","xx",null,null,null,null,null,null,null,null,null,null,null,null,0,"xx","xx","xx",99,null,null,null,null,null,0,"xx",null,21,null,null,null,"xx","xx","xx","xx","xx","xx","xx","xx","xx","xx","xx","xx","xx","xx","xx","xx","xx","xx","xx","xx","xx","xx",null,null,null,null,null,null,null,null,null,null,null,null,"xx"]
[22,"Vinterrug (hybrid og syntetisk), sået inden 1. august",null,null,{"$f":"IF('Efterafgrøde beslutningsstøtte'!A$7<>\"Pligtig mellemafgrøde\",HYPERLINK(\"https://dyrk-plant.dlbr.dk/Web/(S(ikevr3oqnx5oe2t5cyfyknyq))/forms/Main.aspx?page=Vejledning&cropID=226\",\"Efterafgrøder\"),HYPERLINK(\"https://dyrk-plant.dlbr.dk/Web/(S(0x3ftyiaahcpttq0ljebuany))/forms/Main.aspx?page=Vejledning&cropID=238\",\"Mellemafgrøder\"))","v":"Efterafgrøder"},"xx","xx","xx","xx","xx","xx","xx","xx","xx","xx","xx","xx","xx","xx","xx","xx","xx","xx","xx","xx","xx","xx","xx",null,null,null,null,null,null,null,null,null,"xx",null,null,null,null,null,null,null,null,null,null,null,null,"xx","xx","xx","xx","xx","xx","xx","xx","xx","xx","xx","xx","xx","xx","xx","xx","xx","xx","xx","xx","xx","xx",null,null,null,null,null,null,null,null,null,null,"xx",null,null,"xx","xx","xx","xx","xx","xx","xx","xx","xx","xx","xx","xx","xx","xx","xx","xx","xx","xx","xx","xx",null,"xx",null,null,null,null,null,null,null,null,null,null,"xx",null,null,null,"xx","xx","xx","xx","xx","xx","xx","xx","xx","xx","xx","xx","xx","xx","xx","xx","xx","xx","xx","xx","xx",null,null,null,null,null,null,null,null,null,null,null,null,null,null,null,"xx","xx","xx","xx","xx","xx","xx","xx","xx","xx","xx","xx","xx","xx","xx","xx","xx","xx","xx","xx","xx",null,null,null,null,null,null,null,null,null,null,null,null,0,"xx","xx","xx",99,null,null,null,null,null,0,"xx",null,22,null,null,null,"xx","xx","xx","xx","xx","xx","xx","xx","xx","xx","xx","xx","xx","xx","xx","xx","xx","xx","xx","xx","xx","xx",null,null,null,null,null,null,null,null,null,null,null,null,"xx"]
[23,"Vinterrug (hybrid og syntetisk), sået inden 20. august",null,null,{"$f":"IF('Efterafgrøde beslutningsstøtte'!A$7<>\"Pligtig mellemafgrøde\",HYPERLINK(\"https://dyrk-plant.dlbr.dk/Web/(S(ikevr3oqnx5oe2t5cyfyknyq))/forms/Main.aspx?page=Vejledning&cropID=226\",\"Efterafgrøder\"),HYPERLINK(\"https://dyrk-plant.dlbr.dk/Web/(S(0x3ftyiaahcpttq0ljebuany))/forms/Main.aspx?page=Vejledning&cropID=238\",\"Mellemafgrøder\"))","v":"Efterafgrøder"},"xx","xx","xx","xx","xx","xx","xx","xx","xx","xx","xx","xx","xx","xx","xx","xx","xx","xx","xx","xx","xx","xx","xx",null,null,null,null,null,null,null,null,null,"xx",null,null,null,null,null,null,null,null,null,null,null,null,"xx","xx","xx","xx","xx","xx","xx","xx","xx","xx","xx","xx","xx","xx","xx","xx","xx","xx","xx","xx","xx","xx",null,null,null,null,null,null,null,null,null,null,"xx",null,null,"xx","xx","xx","xx","xx","xx","xx","xx","xx","xx","xx","xx","xx","xx","xx","xx","xx","xx","xx","xx",null,"xx",null,null,null,null,null,null,null,null,null,null,"xx",null,null,null,"xx","xx","xx","xx","xx","xx","xx","xx","xx","xx","xx","xx","xx","xx","xx","xx","xx","xx","xx","xx","xx",null,null,null,null,null,null,null,null,null,null,null,null,null,null,null,"xx","xx","xx","xx","xx","xx","xx","xx","xx","xx","xx","xx","xx","xx","xx","xx","xx","xx","xx","xx","xx",null,null,null,null,null,null,null,null,null,null,null,null,0,"xx","xx","xx",99,null,null,null,null,null,0,"xx",null,23,null,null,null,"xx","xx","xx","xx","xx","xx","xx","xx","xx","xx","xx","xx","xx","xx","xx","xx","xx","xx","xx","xx","xx","xx",null,null,null,null,null,null,null,null,null,null,null,null,"xx"]
[24,"Cikorie",null,null,{"$f":"IF('Efterafgrøde beslutningsstøtte'!A$7<>\"Pligtig mellemafgrøde\",HYPERLINK(\"https://dyrk-plant.dlbr.dk/Web/(S(ikevr3oqnx5oe2t5cyfyknyq))/forms/Main.aspx?page=Vejledning&cropID=226\",\"Efterafgrøder\"),HYPERLINK(\"https://dyrk-plant.dlbr.dk/Web/(S(0x3ftyiaahcpttq0ljebuany))/forms/Main.aspx?page=Vejledning&cropID=238\",\"Mellemafgrøder\"))","v":"Efterafgrøder"},"xx","xx","xx","xx","xx","xx","xx","xx","xx","xx","xx","xx","xx","xx","xx","xx","xx","xx","xx","xx","xx","xx","xx",null,null,null,null,null,null,null,null,null,"xx",null,null,null,null,null,null,null,null,null,null,null,null,"xx","xx","xx","xx","xx","xx","xx","xx","xx","xx","xx","xx","xx","xx","xx","xx","xx","xx","xx","xx","xx","xx",null,null,null,null,null,null,null,null,null,null,"xx",null,null,"xx","xx","xx","xx","xx","xx","xx","xx","xx","xx","xx","xx","xx","xx","xx","xx","xx","xx","xx","xx",null,"xx",null,null,null,null,null,null,null,null,null,null,"xx",null,null,null,"xx","xx","xx","xx","xx","xx","xx","xx","xx","xx","xx","xx","xx","xx","xx","xx","xx","xx","xx","xx","xx",null,null,null,null,null,null,null,null,null,null,null,null,null,null,null,"xx","xx","xx","xx","xx","xx","xx","xx","xx","xx","xx","xx","xx","xx","xx","xx","xx","xx","xx","xx","xx",null,null,null,null,null,null,null,null,null,null,null,null,0,"xx","xx","xx",99,null,null,null,null,null,0,"xx",null,24,null,null,null,"xx","xx","xx","xx","xx","xx","xx","xx","xx","xx","xx","xx","xx","xx","xx","xx","xx","xx","xx","xx","xx","xx",null,null,null,null,null,null,null,null,null,null,null,null,"xx"]
[25,"Honningurt",null,null,{"$f":"IF('Efterafgrøde beslutningsstøtte'!A$7<>\"Pligtig mellemafgrøde\",HYPERLINK(\"https://dyrk-plant.dlbr.dk/Web/(S(ikevr3oqnx5oe2t5cyfyknyq))/forms/Main.aspx?page=Vejledning&cropID=226\",\"Efterafgrøder\"),HYPERLINK(\"https://dyrk-plant.dlbr.dk/Web/(S(0x3ftyiaahcpttq0ljebuany))/forms/Main.aspx?page=Vejledning&cropID=238\",\"Mellemafgrøder\"))","v":"Efterafgrøder"},"xx","xx","xx","xx","xx","xx","xx","xx","xx","xx","xx","xx","xx","xx","xx","xx","xx","xx","xx","xx","xx","xx","xx",null,null,null,null,null,null,null,null,null,"xx",null,null,null,null,null,null,null,null,null,null,null,null,"xx","xx","xx","xx","xx","xx","xx","xx","xx","xx","xx","xx","xx","xx","xx","xx","xx","xx","xx","xx","xx","xx",null,null,null,null,null,null,null,null,null,null,"xx",null,null,"xx","xx","xx","xx","xx","xx","xx","xx","xx","xx","xx","xx","xx","xx","xx","xx","xx","xx","xx","xx",null,"xx",null,null,null,null,null,null,null,null,null,null,"xx",null,null,null,"xx","xx","xx","xx","xx","xx","xx","xx","xx","xx","xx","xx","xx","xx","xx","xx","xx","xx","xx","xx","xx",null,null,null,null,null,null,null,null,null,null,null,null,null,null,null,"xx","xx","xx","xx","xx","xx","xx","xx","xx","xx","xx","xx","xx","xx","xx","xx","xx","xx","xx","xx","xx",null,null,null,null,null,null,null,null,null,null,null,null,0,"xx","xx","xx",99,null,null,null,null,null,0,"xx",null,25,null,null,null,"xx","xx","xx","xx","xx","xx","xx","xx","xx","xx","xx","xx","xx","xx","xx","xx","xx","xx","xx","xx","xx","xx",null,null,null,null,null,null,null,null,null,null,null,null,"xx"]
[26,"Fodervikke ",null,null,{"$f":"IF('Efterafgrøde beslutningsstøtte'!A$7<>\"Pligtig mellemafgrøde\",HYPERLINK(\"https://dyrk-plant.dlbr.dk/Web/(S(ikevr3oqnx5oe2t5cyfyknyq))/forms/Main.aspx?page=Vejledning&cropID=226\",\"Efterafgrøder\"),HYPERLINK(\"https://dyrk-plant.dlbr.dk/Web/(S(0x3ftyiaahcpttq0ljebuany))/forms/Main.aspx?page=Vejledning&cropID=238\",\"Mellemafgrøder\"))","v":"Efterafgrøder"},"xx","xx","xx","xx","xx","xx","xx","xx","xx","xx","xx","xx","xx","xx","xx","xx","xx","xx","xx","xx","xx","xx","xx",null,null,null,null,null,null,null,null,null,"xx",null,null,null,null,null,null,null,null,null,null,null,null,"xx","xx","xx","xx","xx","xx","xx","xx","xx","xx","xx","xx","xx","xx","xx","xx","xx","xx","xx","xx","xx","xx",null,null,null,null,null,null,null,null,null,null,"xx",null,null,"xx","xx","xx","xx","xx","xx","xx","xx","xx","xx","xx","xx","xx","xx","xx","xx","xx","xx","xx","xx",null,"xx",null,null,null,null,null,null,null,null,null,null,"xx",null,null,null,"xx","xx","xx","xx","xx","xx","xx","xx","xx","xx","xx","xx","xx","xx","xx","xx","xx","xx","xx","xx","xx",null,null,null,null,null,null,null,null,null,null,null,null,null,null,null,"xx","xx","xx","xx","xx","xx","xx","xx","xx","xx","xx","xx","xx","xx","xx","xx","xx","xx","xx","xx","xx",null,null,null,null,null,null,null,null,null,null,null,null,0,"xx","xx","xx",99,null,null,null,null,null,0,"xx",null,26,null,null,null,"xx","xx","xx","xx","xx","xx","xx","xx","xx","xx","xx","xx","xx","xx","xx","xx","xx","xx","xx","xx","xx","xx",null,null,null,null,null,null,null,null,null,null,null,null,"xx"]
[27,"Vintervikke",null,null,{"$f":"IF('Efterafgrøde beslutningsstøtte'!A$7<>\"Pligtig mellemafgrøde\",HYPERLINK(\"https://dyrk-plant.dlbr.dk/Web/(S(ikevr3oqnx5oe2t5cyfyknyq))/forms/Main.aspx?page=Vejledning&cropID=226\",\"Efterafgrøder\"),HYPERLINK(\"https://dyrk-plant.dlbr.dk/Web/(S(0x3ftyiaahcpttq0ljebuany))/forms/Main.aspx?page=Vejledning&cropID=238\",\"Mellemafgrøder\"))","v":"Efterafgrøder"},"xx","xx","xx","xx","xx","xx","xx","xx","xx","xx","xx","xx","xx","xx","xx","xx","xx","xx","xx","xx","xx","xx","xx",null,null,null,null,null,null,null,null,null,"xx",null,null,null,null,null,null,null,null,null,null,null,null,"xx","xx","xx","xx","xx","xx","xx",{"$f":"M67","v":"xx"},"xx","xx","xx","xx","xx","xx","xx","xx","xx","xx","xx","xx","xx","xx",null,null,null,null,null,null,null,null,null,null,"xx",null,null,"xx","xx","xx","xx","xx","xx","xx","xx","xx","xx","xx","xx","xx","xx","xx","xx","xx","xx","xx","xx",null,"xx",null,null,null,null,null,null,null,null,null,null,"xx",null,null,null,"xx","xx","xx","xx","xx","xx","xx","xx","xx","xx","xx","xx","xx","xx","xx","xx","xx","xx","xx","xx","xx",null,null,null,null,null,null,null,null,null,null,null,null,null,null,null,"xx","xx","xx","xx","xx","xx","xx","xx","xx","xx","xx","xx","xx","xx","xx","xx","xx","xx","xx","xx","xx",null,null,null,null,null,null,null,null,null,null,null,null,0,"xx","xx","xx",99,null,null,null,null,null,0,"xx",null,27,null,null,null,"xx","xx","xx","xx","xx","xx","xx","xx","xx","xx","xx","xx","xx","xx","xx","xx","xx","xx","xx","xx","xx","xx",null,null,null,null,null,null,null,null,null,null,null,null,"xx"]
[28,"Alexandrinekløver",null,null,{"$f":"IF('Efterafgrøde beslutningsstøtte'!A$7<>\"Pligtig mellemafgrøde\",HYPERLINK(\"https://dyrk-plant.dlbr.dk/Web/(S(ikevr3oqnx5oe2t5cyfyknyq))/forms/Main.aspx?page=Vejledning&cropID=226\",\"Efterafgrøder\"),HYPERLINK(\"https://dyrk-plant.dlbr.dk/Web/(S(0x3ftyiaahcpttq0ljebuany))/forms/Main.aspx?page=Vejledning&cropID=238\",\"Mellemafgrøder\"))","v":"Efterafgrøder"},"xx","xx","xx","xx","xx","xx","xx","xx","xx","xx","xx","xx","xx","xx","xx","xx","xx","xx","xx","xx","xx","xx","xx",null,null,null,null,null,null,null,null,null,"xx",null,null,null,null,null,null,null,null,null,null,null,null,"xx","xx","xx","xx",{"$f":"J68","v":"xx"},"xx","xx","xx","xx","xx","xx","xx","xx","xx","xx","xx","xx","xx","xx","xx","xx","xx",null,null,null,null,null,null,null,null,null,null,"xx",null,null,"xx","xx","xx","xx","xx","xx","xx","xx","xx","xx","xx","xx","xx","xx","xx","xx","xx","xx","xx","xx",null,"xx",null,null,null,null,null,null,null,null,null,null,"xx",null,null,null,"xx","xx","xx","xx","xx","xx","xx","xx","xx","xx","xx","xx","xx","xx","xx","xx","xx","xx","xx","xx","xx",null,null,null,null,null,null,null,null,null,null,null,null,null,null,null,"xx","xx","xx","xx","xx","xx","xx","xx","xx","xx","xx","xx","xx","xx","xx","xx","xx","xx","xx","xx","xx",null,null,null,null,null,null,null,null,null,null,null,null,0,"xx","xx","xx",99,null,null,null,null,null,0,"xx",null,28,null,null,null,"xx","xx","xx","xx","xx","xx","xx","xx","xx","xx","xx","xx","xx","xx","xx","xx","xx","xx","xx","xx","xx","xx",null,null,null,null,null,null,null,null,null,null,null,null,"xx"]
[29,"Hvidkløver",null,null,{"$f":"IF('Efterafgrøde beslutningsstøtte'!A$7<>\"Pligtig mellemafgrøde\",HYPERLINK(\"https://dyrk-plant.dlbr.dk/Web/(S(ikevr3oqnx5oe2t5cyfyknyq))/forms/Main.aspx?page=Vejledning&cropID=226\",\"Efterafgrøder\"),HYPERLINK(\"https://dyrk-plant.dlbr.dk/Web/(S(0x3ftyiaahcpttq0ljebuany))/forms/Main.aspx?page=Vejledning&cropID=238\",\"Mellemafgrøder\"))","v":"Efterafgrøder"},"xx","xx","xx","xx","xx","xx","xx","xx","xx","xx","xx","xx","xx","xx","xx","xx","xx","xx","xx","xx","xx","xx","xx",null,null,null,null,null,null,null,null,null,"xx",null,null,null,null,null,null,null,null,null,null,null,null,"xx","xx","xx","xx","xx","xx","xx","xx","xx","xx","xx","xx","xx","xx","xx","xx","xx","xx","xx","xx","xx","xx",null,null,null,null,null,null,null,null,null,null,"xx",null,null,"xx","xx","xx","xx","xx","xx","xx","xx","xx","xx","xx","xx","xx","xx","xx","xx","xx","xx","xx","xx",null,"xx",null,null,null,null,null,null,null,null,null,null,"xx",null,null,null,"xx","xx","xx","xx","xx","xx","xx","xx","xx","xx","xx","xx","xx","xx","xx","xx","xx","xx","xx","xx","xx",null,null,null,null,null,null,null,null,null,null,null,null,null,null,null,"xx","xx","xx","xx","xx","xx","xx","xx","xx","xx","xx","xx","xx","xx","xx","xx","xx","xx","xx","xx","xx",null,null,null,null,null,null,null,null,null,null,null,null,0,"xx","xx","xx",99,null,null,null,null,null,0,"xx",null,29,null,null,null,"xx","xx","xx","xx",{"$f":"IF($GS69=0,\"xx\",INDEX($CH$41:$DN$112,$GT69,HD$12))","v":"xx"},"xx","xx","xx","xx","xx","xx","xx","xx","xx","xx","xx","xx","xx","xx","xx","xx","xx",null,null,null,null,null,null,null,null,null,null,null,null,"xx"]
[30,"Blanding af olieræddike og fodervikke",null,null,{"$f":"IF('Efterafgrøde beslutningsstøtte'!A$7<>\"Pligtig mellemafgrøde\",HYPERLINK(\"https://dyrk-plant.dlbr.dk/Web/(S(ikevr3oqnx5oe2t5cyfyknyq))/forms/Main.aspx?page=Vejledning&cropID=226\",\"Efterafgrøder\"),HYPERLINK(\"https://dyrk-plant.dlbr.dk/Web/(S(0x3ftyiaahcpttq0ljebuany))/forms/Main.aspx?page=Vejledning&cropID=238\",\"Mellemafgrøder\"))","v":"Efterafgrøder"},"xx","xx","xx","xx","xx","xx","xx","xx","xx","xx","xx","xx","xx","xx","xx","xx","xx","xx","xx","xx","xx","xx","xx",null,null,null,null,null,null,null,null,null,"xx",null,null,null,null,null,null,null,null,null,null,null,null,{"$f":"F70","v":"xx"},{"$f":"G70","v":"xx"},{"$f":"H70","v":"xx"},{"$f":"I70","v":"xx"},"xx","xx","xx","xx","xx","xx","xx","xx","xx","xx","xx","xx","xx","xx","xx","xx","xx","xx",null,null,null,null,null,null,null,null,null,null,"xx",null,null,"xx","xx","xx","xx","xx","xx","xx","xx","xx","xx","xx","xx","xx","xx","xx","xx","xx","xx","xx","xx",null,"xx",null,null,null,null,null,null,null,null,null,null,"xx",null,null,null,"xx","xx","xx","xx","xx","xx","xx","xx","xx","xx","xx","xx","xx","xx","xx","xx","xx","xx","xx","xx","xx",null,null,null,null,null,null,null,null,null,null,null,null,null,null,null,"xx","xx","xx","xx","xx","xx","xx","xx","xx","xx","xx","xx","xx","xx","xx","xx","xx","xx","xx","xx","xx",null,null,null,null,null,null,null,null,null,null,null,null,0,{"$f":"IF(FB70=\"xx\",\"xx\",GI70)","v":"xx"},"xx","xx",99,null,null,null,null,null,{"$f":"COUNTIF($GM$41:$GM$112,GV70)","v":0},{"$f":"IF(GS70>0,MATCH(GV70,$GM$41:$GM$112,0),\"xx\")","v":"xx"},null,30]
[31,"Hvidkløver/alm. rajgræs",null,null,{"$f":"IF('Efterafgrøde beslutningsstøtte'!A$7<>\"Pligtig mellemafgrøde\",HYPERLINK(\"https://dyrk-plant.dlbr.dk/Web/(S(ikevr3oqnx5oe2t5cyfyknyq))/forms/Main.aspx?page=Vejledning&cropID=226\",\"Efterafgrøder\"),HYPERLINK(\"https://dyrk-plant.dlbr.dk/Web/(S(0x3ftyiaahcpttq0ljebuany))/forms/Main.aspx?page=Vejledning&cropID=238\",\"Mellemafgrøder\"))","v":"Efterafgrøder"},"xx","xx","xx","xx","xx","xx","xx","xx","xx","xx","xx","xx","xx","xx","xx","xx","xx","xx","xx","xx","xx","xx","xx",null,null,null,null,null,null,null,null,null,"xx",null,null,null,null,null,null,null,null,null,null,null,null,"xx","xx","xx","xx","xx","xx","xx","xx","xx","xx","xx","xx","xx","xx","xx","xx","xx","xx","xx","xx","xx","xx",null,null,null,null,null,null,null,null,null,null,"xx",null,null,"xx","xx","xx","xx","xx","xx","xx","xx","xx","xx","xx","xx","xx","xx","xx","xx","xx","xx","xx","xx",null,"xx",null,null,null,null,null,null,null,null,null,null,"xx",null,null,null,"xx","xx","xx","xx","xx","xx","xx","xx","xx","xx","xx","xx","xx","xx","xx","xx","xx","xx","xx","xx","xx",null,null,null,null,null,null,null,null,null,null,null,null,null,null,null,"xx","xx","xx","xx","xx","xx","xx","xx","xx","xx","xx","xx","xx","xx","xx","xx","xx","xx","xx","xx","xx",null,null,null,null,null,null,null,null,null,null,null,null,0,{"$f":"IF(FB71=\"xx\",\"xx\",GI71)","v":"xx"},"xx","xx",99,null,null,null,null,null,{"$f":"COUNTIF($GM$41:$GM$112,GV71)","v":0},{"$f":"IF(GS71>0,MATCH(GV71,$GM$41:$GM$112,0),\"xx\")","v":"xx"},null,31]
[32,"Rødkløver/strandsvingel",null,null,{"$f":"IF('Efterafgrøde beslutningsstøtte'!A$7<>\"Pligtig mellemafgrøde\",HYPERLINK(\"https://dyrk-plant.dlbr.dk/Web/(S(ikevr3oqnx5oe2t5cyfyknyq))/forms/Main.aspx?page=Vejledning&cropID=226\",\"Efterafgrøder\"),HYPERLINK(\"https://dyrk-plant.dlbr.dk/Web/(S(0x3ftyiaahcpttq0ljebuany))/forms/Main.aspx?page=Vejledning&cropID=238\",\"Mellemafgrøder\"))","v":"Efterafgrøder"},"xx","xx","xx","xx","xx","xx","xx","xx","xx","xx","xx","xx","xx","xx","xx","xx","xx","xx","xx","xx","xx","xx","xx",null,null,null,null,null,null,null,null,null,"xx",null,null,null,null,null,null,null,null,null,null,null,null,"xx","xx","xx","xx","xx","xx","xx","xx","xx","xx","xx","xx","xx","xx","xx","xx","xx","xx","xx","xx","xx","xx",null,null,null,null,null,null,null,null,null,null,"xx",null,null,"xx","xx","xx","xx","xx","xx","xx","xx","xx","xx","xx","xx","xx","xx","xx","xx","xx","xx","xx","xx",null,"xx",null,null,null,null,null,null,null,null,null,null,"xx",null,null,null,"xx","xx","xx","xx","xx","xx","xx","xx","xx","xx","xx","xx","xx","xx","xx","xx","xx","xx","xx","xx","xx",null,null,null,null,null,null,null,null,null,null,null,null,null,null,null,"xx","xx","xx","xx","xx","xx","xx","xx","xx","xx","xx","xx","xx","xx","xx","xx","xx","xx","xx","xx","xx",null,null,null,null,null,null,null,null,null,null,null,null,0,"xx","xx","xx",99,null,null,null,null,null,0,"xx",null,32]
[33,"Vintervikke/vinterrug",null,null,{"$f":"IF('Efterafgrøde beslutningsstøtte'!A$7<>\"Pligtig mellemafgrøde\",HYPERLINK(\"https://dyrk-plant.dlbr.dk/Web/(S(ikevr3oqnx5oe2t5cyfyknyq))/forms/Main.aspx?page=Vejledning&cropID=226\",\"Efterafgrøder\"),HYPERLINK(\"https://dyrk-plant.dlbr.dk/Web/(S(0x3ftyiaahcpttq0ljebuany))/forms/Main.aspx?page=Vejledning&cropID=238\",\"Mellemafgrøder\"))","v":"Efterafgrøder"},"xx","xx","xx","xx","xx","xx","xx","xx","xx","xx","xx","xx","xx","xx","xx","xx","xx","xx","xx","xx","xx","xx","xx",null,null,null,null,null,null,null,null,null,"xx",null,null,null,null,null,null,null,null,null,null,null,null,"xx","xx","xx","xx","xx","xx","xx","xx","xx","xx","xx","xx","xx","xx","xx","xx","xx","xx","xx","xx","xx","xx",null,null,null,null,null,null,null,null,null,null,"xx",null,null,"xx","xx","xx","xx","xx","xx","xx","xx","xx","xx","xx","xx","xx","xx","xx","xx","xx","xx","xx","xx",null,"xx",null,null,null,null,null,null,null,null,null,null,"xx",null,null,null,"xx","xx","xx","xx","xx","xx","xx","xx","xx","xx","xx","xx","xx","xx","xx","xx","xx","xx","xx","xx","xx",null,null,null,null,null,null,null,null,null,null,null,null,null,null,null,"xx","xx","xx","xx","xx","xx","xx","xx","xx","xx","xx","xx","xx","xx","xx","xx","xx","xx","xx","xx","xx",null,null,null,null,null,null,null,null,null,null,null,null,0,"xx","xx","xx",99,null,null,null,null,null,0,"xx",null,33]
[34,"Kløvergræs",null,null,{"$f":"IF('Efterafgrøde beslutningsstøtte'!A$7<>\"Pligtig mellemafgrøde\",HYPERLINK(\"https://dyrk-plant.dlbr.dk/Web/(S(ikevr3oqnx5oe2t5cyfyknyq))/forms/Main.aspx?page=Vejledning&cropID=226\",\"Efterafgrøder\"),HYPERLINK(\"https://dyrk-plant.dlbr.dk/Web/(S(0x3ftyiaahcpttq0ljebuany))/forms/Main.aspx?page=Vejledning&cropID=238\",\"Mellemafgrøder\"))","v":"Efterafgrøder"},"xx","xx","xx","xx","xx","xx","xx","xx","xx","xx","xx","xx","xx","xx","xx","xx","xx","xx","xx","xx","xx","xx","xx",null,null,null,null,null,null,null,null,null,"xx",null,null,null,null,null,null,null,null,null,null,null,null,"xx","xx","xx","xx","xx","xx","xx","xx","xx","xx","xx","xx","xx","xx","xx","xx","xx","xx","xx","xx","xx","xx",null,null,null,null,null,null,null,null,null,null,"xx",null,null,"xx","xx","xx","xx","xx","xx","xx","xx","xx","xx","xx","xx","xx","xx","xx","xx","xx","xx","xx","xx",null,{"$f":"BT74","v":"xx"},null,null,null,null,null,null,null,null,null,null,"xx",null,null,null,"xx","xx","xx","xx","xx","xx","xx","xx","xx","xx","xx","xx","xx","xx","xx","xx","xx","xx","xx","xx","xx",null,null,null,null,null,null,null,null,null,null,null,null,null,null,null,"xx","xx","xx","xx","xx","xx","xx","xx","xx","xx","xx","xx","xx","xx","xx","xx","xx","xx","xx","xx","xx",null,null,null,null,null,null,null,null,null,null,null,null,0,"xx","xx","xx",99,null,null,null,null,null,0,"xx",null,34]
[]
[]
[]
[null,null,null,null,null,null,null,null,null,null,null,null,null,null,null,null,null,null,null,null,null,null,null," "]
[null,null,null,null,null,null,null,null,null,null,null,null,null,null,null,null,null,null,null,null,null,null,null,null,null,null,null,null,null,null,null,null,null,null,null,null,null,null,null,null,null,null,null,null,null,null,null,null,null,null,null,null,null,null,null,null,null,null,null,null,null,null,null,null,null,null,null,null,null,null,null,null,null,null,null,null,null,null,null,null,null,null,null,null,null,null,null,null,null,null,null,null,null,null,null,null,null,null,null,null,null,null,null,null,null,null,null,null,null,null,null,null,null,null,null,null,null,null,null,null,null,null,null,null,null,null,null,null,null,null,null,null,null,null,null,null,null,null,null,null,null,null,null,null,null,null,null,null,null,null,null,null,null,null,null,null,null,null,null,null,null,null,null,null,null,null,null,null,null,null,null,null,null,null,null,null,null,null,null,null,null,null,null,null,null,null,null,null,null,null,null,null,null,null,null,null,null,null,null,null,null,null,null,null,null,null,"Frontend output"]
[null,null,null,null,null,null,null,null,null,null,null,null,null,null,null,null,null,null,null,null,null,null,null,null,null,null,null,null,null,null,null,null,null,null,null,null,null,null,null,null,null,null,null,null,null,null,null,null,null,null,null,null,null,null,null,null,null,null,null,null,null,null,null,null,null,null,null,null,null,null,null,null,null,null,null,null,null,null,null,null,null,null,null,null,null,null,null,null,null,null,null,null,null,null,null,null,null,null,null,null,null,null,null,null,null,null,null,null,null,null,null,null,null,null,null,null,null,null,null,null,null,null,null,null,null,null,null,null,null,null,null,null,null,null,null,null,null,null,null,null,null,null,null,null,null,null,null,null,null,null,null,null,null,null,null,null,null,null,null,null,null,null,null,null,null,null,null,null,null,null,null,null,null,null,null,null,null,null,null,null,null,null,null,null,null,null,null,null,null,null,null,null,null,null,null,null,null,null,null,null,null,null,null,null,null,null,null,{"$f":"GZ40","v":"Efterafgrøde"},"Pris","Nettoomkostninger","Er afgrøden robust mod ukrudtsmidler?","Der findes sorter, der ikke opformerer kålbrok","Der findes sorter, der er sanerende for roecystenematoder","Vinterfast","Egen udsæd kan anvendes","Hurtig og dyb rodvækst på lerjord","Kvælstoffikserende","Stor kvælstof-eftervirkning","Pligtig efterafgrøde","Pligtig mellemafgrøde","MFO-efterafgrøde i blanding2)","MFO-udlæg","Miljø-efterafgrøder","Frivillig efterafgrøde","Grønne marker (2,3 DE-brug)","Egnet til udlæg efterår i vinterkorn","Egnet til udlæg forår","Egnet til udsåning 2-3 uger før høst","Egnet til udsåning efter tidlig høst (10. august)",null,null,null,null,null,null,null,null,null,null,null,null,{"$f":"IF(IH40=\"xx\",\"\",IH40)","v":"Vejledning"}]
[null,null,null,null,null,null,null,null,null,null,null,null,null,null,null,null,null,null,null,null,null,null,null,null,null,null,null,null,null,null,null,null,null,null,null,null,null,null,null,null,null,null,null,null,null,null,null,null,null,null,null,null,null,null,null,null,null,null,null,null,null,null,null,null,null,null,null,null,null,null,null,null,null,null,null,null,null,null,null,null,null,null,null,null,null,null,null,null,null,null,null,null,null,null,null,null,null,null,null,null,null,null,null,null,null,null,null,null,null,null,null,null,null,null,null,null,null,null,null,null,null,null,null,null,null,null,null,null,null,null,null,null,null,null,null,null,null,null,null,null,null,null,null,null,null,null,null,null,null,null,null,null,null,null,null,null,null,null,null,null,null,null,null,null,null,null,null,null,null,null,null,null,null,null,null,null,null,null,null,null,null,null,null,null,null,null,null,null,null,null,null,null,null,null,null,null,null,null,null,null,null,null,null,null,null,null,null,{"$f":"IF(GZ41=\"xx\",\"\",GZ41)","v":""},{"$f":"IF(HA41=\"xx\",\"\",HA41)","v":""},"","","","","","","","","","","","","","","","","","","","",null,null,null,null,null,null,null,null,null,null,null,null,{"$f":"IF(IH41=\"xx\",\"\",IH41)","v":""}]
[null,null,null,null,null,null,null,null,null,null,null,null,null,null,null,null,null,null,null,null,null,null,null,null,null,null,null,null,null,null,null,null,null,null,null,null,null,null,null,null,null,null,null,null,null,null,null,null,null,null,null,null,null,null,null,null,null,null,null,null,null,null,null,null,null,null,null,null,null,null,null,null,null,null,null,null,null,null,null,null,null,null,null,null,null,null,null,null,null,null,null,null,null,null,null,null,null,null,null,null,null,null,null,null,null,null,null,null,null,null,null,null,null,null,null,null,null,null,null,null,null,null,null,null,null,null,null,null,null,null,null,null,null,null,null,null,null,null,null,null,null,null,null,null,null,null,null,null,null,null,null,null,null,null,null,null,null,null,null,null,null,null,null,null,null,null,null,null,null,null,null,null,null,null,null,null,null,null,null,null,null,null,null,null,null,null,null,null,null,null,null,null,null,null,null,null,null,null,null,null,null,null,null,null,null,null,null,{"$f":"IF(GZ42=\"xx\",\"\",GZ42)","v":""},"","","","","","","","","","","","","","","","","","","","","",null,null,null,null,null,null,null,null,null,null,null,null,{"$f":"IF(IH42=\"xx\",\"\",IH42)","v":""}]
[null,null,null,null,null,null,null,null,null,null,null,null,null,null,null,null,null,null,null,null,null,null,null,null,null,null,null,null,null,null,null,null,null,null,null,null,null,null,null,null,null,null,null,null,null,null,null,null,null,null,null,null,null,null,null,null,null,null,null,null,null,null,null,null,null,null,null,null,null,null,null,null,null,null,null,null,null,null,null,null,null,null,null,null,null,null,null,null,null,null,null,null,null,null,null,null,null,null,null,null,null,null,null,null,null,null,null,null,null,null,null,null,null,null,null,null,null,null,null,null,null,null,null,null,null,null,null,null,null,null,null,null,null,null,null,null,null,null,null,null,null,null,null,null,null,null,null,null,null,null,null,null,null,null,null,null,null,null,null,null,null,null,null,null,null,null,null,null,null,null,null,null,null,null,null,null,null,null,null,null,null,null,null,null,null,null,null,null,null,null,null,null,null,null,null,null,null,null,null,null,null,null,null,null,null,null,null,{"$f":"IF(GZ43=\"xx\",\"\",GZ43)","v":""},"","","","","","","","","","","","","","","","","","","","","",null,null,null,null,null,null,null,null,null,null,null,null,""]
[null,null,null,null,null,null,null,null,null,null,null,null,null,null,null,null,null,null,null,null,null,null,null,null,null,null,null,null,null,null,null,null,null,null,null,null,null,null,null,null,null,null,null,null,null,null,null,null,null,null,null,null,null,null,null,null,null,null,null,null,null,null,null,null,null,null,null,null,null,null,null,null,null,null,null,null,null,null,null,null,null,null,null,null,null,null,null,null,null,null,null,null,null,null,null,null,null,null,null,null,null,null,null,null,null,null,null,null,null,null,null,null,null,null,null,null,null,null,null,null,null,null,null,null,null,null,null,null,null,null,null,null,null,null,null,null,null,null,null,null,null,null,null,null,null,null,null,null,null,null,null,null,null,null,null,null,null,null,null,null,null,null,null,null,null,null,null,null,null,null,null,null,null,null,null,null,null,null,null,null,null,null,null,null,null,null,null,null,null,null,null,null,null,null,null,null,null,null,null,null,null,null,null,null,null,null,null,{"$f":"IF(GZ44=\"xx\",\"\",GZ44)","v":""},"","","","","","","","","","","","","","","","","","","","","",null,null,null,null,null,null,null,null,null,null,null,null,""]
[null,null,null,null,null,null,null,null,null,null,null,null,null,null,null,null,null,null,null,null,null,null,null,null,null,null,null,null,null,null,null,null,null,null,null,null,null,null,null,null,null,null,null,null,null,null,null,null,null,null,null,null,null,null,null,null,null,null,null,null,null,null,null,null,null,null,null,null,null,null,null,null,null,null,null,null,null,null,null,null,null,null,null,null,null,null,null,null,null,null,null,null,null,null,null,null,null,null,null,null,null,null,null,null,null,null,null,null,null,null,null,null,null,null,null,null,null,null,null,null,null,null,null,null,null,null,null,null,null,null,null,null,null,null,null,null,null,null,null,null,null,null,null,null,null,null,null,null,null,null,null,null,null,null,null,null,null,null,null,null,null,null,null,null,null,null,null,null,null,null,null,null,null,null,null,null,null,null,null,null,null,null,null,null,null,null,null,null,null,null,null,null,null,null,null,null,null,null,null,null,null,null,null,null,null,null,null,{"$f":"IF(GZ45=\"xx\",\"\",GZ45)","v":""},"","","","","","","","","","","","","","","","","","","","","",null,null,null,null,null,null,null,null,null,null,null,null,""]
[null,null,null,null,null,null,null,null,null,null,null,null,null,null,null,null,null,null,null,null,null,null,null,null,null,null,null,null,null,null,null,null,null,null,null,null,null,null,null,null,null,null,null,null,null,null,null,null,null,null,null,null,null,null,null,null,null,null,null,null,null,null,null,null,null,null,null,null,null,null,null,null,null,null,null,null,null,null,null,null,null,null,null,null,null,null,null,null,null,null,null,null,null,null,null,null,null,null,null,null,null,null,null,null,null,null,null,null,null,null,null,null,null,null,null,null,null,null,null,null,null,null,null,null,null,null,null,null,null,null,null,null,null,null,null,null,null,null,null,null,null,null,null,null,null,null,null,null,null,null,null,null,null,null,null,null,null,null,null,null,null,null,null,null,null,null,null,null,null,null,null,null,null,null,null,null,null,null,null,null,null,null,null,null,null,null,null,null,null,null,null,null,null,null,null,null,null,null,null,null,null,null,null,null,null,null,null,{"$f":"IF(GZ46=\"xx\",\"\",GZ46)","v":""},"","","","","","","","","","","","","","","","","","","","","",null,null,null,null,null,null,null,null,null,null,null,null,""]
[null,null,null,null,null,null,null,null,null,null,null,null,null,null,null,null,null,null,null,null,null,null,null,null,null,null,null,null,null,null,null,null,null,null,null,null,null,null,null,null,null,null,null,null,null,null,null,null,null,null,null,null,null,null,null,null,null,null,null,null,null,null,null,null,null,null,null,null,null,null,null,null,null,null,null,null,null,null,null,null,null,null,null,null,null,null,null,null,null,null,null,null,null,null,null,null,null,null,null,null,null,null,null,null,null,null,null,null,null,null,null,null,null,null,null,null,null,null,null,null,null,null,null,null,null,null,null,null,null,null,null,null,null,null,null,null,null,null,null,null,null,null,null,null,null,null,null,null,null,null,null,null,null,null,null,null,null,null,null,null,null,null,null,null,null,null,null,null,null,null,null,null,null,null,null,null,null,null,null,null,null,null,null,null,null,null,null,null,null,null,null,null,null,null,null,null,null,null,null,null,null,null,null,null,null,null,null,{"$f":"IF(GZ47=\"xx\",\"\",GZ47)","v":""},"","","","","","","","","","","","","","","","","","","","","",null,null,null,null,null,null,null,null,null,null,null,null,""]
[null,null,null,null,null,null,null,null,null,null,null,null,null,null,null,null,null,null,null,null,null,null,null,null,null,null,null,null,null,null,null,null,null,null,null,null,null,null,null,null,null,null,null,null,null,null,null,null,null,null,null,null,null,null,null,null,null,null,null,null,null,null,null,null,null,null,null,null,null,null,null,null,null,null,null,null,null,null,null,null,null,null,null,null,null,null,null,null,null,null,null,null,null,null,null,null,null,null,null,null,null,null,null,null,null,null,null,null,null,null,null,null,null,null,null,null,null,null,null,null,null,null,null,null,null,null,null,null,null,null,null,null,null,null,null,null,null,null,null,null,null,null,null,null,null,null,null,null,null,null,null,null,null,null,null,null,null,null,null,null,null,null,null,null,null,null,null,null,null,null,null,null,null,null,null,null,null,null,null,null,null,null,null,null,null,null,null,null,null,null,null,null,null,null,null,null,null,null,null,null,null,null,null,null,null,null,null,{"$f":"IF(GZ48=\"xx\",\"\",GZ48)","v":""},"","","","","","","","","","","","","","","","","","","","","",null,null,null,null,null,null,null,null,null,null,null,null,""]
[null,null,null,null,null,null,null,null,null,null,null,null,null,null,null,null,null,null,null,null,null,null,null,null,null,null,null,null,null,null,null,null,null,null,null,null,null,null,null,null,null,null,null,null,null,null,null,null,null,null,null,null,null,null,null,null,null,null,null,null,null,null,null,null,null,null,null,null,null,null,null,null,null,null,null,null,null,null,null,null,null,null,null,null,null,null,null,null,null,null,null,null,null,null,null,null,null,null,null,null,null,null,null,null,null,null,null,null,null,null,null,null,null,null,null,null,null,null,null,null,null,null,null,null,null,null,null,null,null,null,null,null,null,null,null,null,null,null,null,null,null,null,null,null,null,null,null,null,null,null,null,null,null,null,null,null,null,null,null,null,null,null,null,null,null,null,null,null,null,null,null,null,null,null,null,null,null,null,null,null,null,null,null,null,null,null,null,null,null,null,null,null,null,null,null,null,null,null,null,null,null,null,null,null,null,null,null,{"$f":"IF(GZ49=\"xx\",\"\",GZ49)","v":""},"","","","","","","","","","","","","","","","","","","","","",null,null,null,null,null,null,null,null,null,null,null,null,""]
[null,null,null,null,null,null,null,null,null,null,null,null,null,null,null,null,null,null,null,null,null,null,null,null,null,null,null,null,null,null,null,null,null,null,null,null,null,null,null,null,null,null,null,null,null,null,null,null,null,null,null,null,null,null,null,null,null,null,null,null,null,null,null,null,null,null,null,null,null,null,null,null,null,null,null,null,null,null,null,null,null,null,null,null,null,null,null,null,null,null,null,null,null,null,null,null,null,null,null,null,null,null,null,null,null,null,null,null,null,null,null,null,null,null,null,null,null,null,null,null,null,null,null,null,null,null,null,null,null,null,null,null,null,null,null,null,null,null,null,null,null,null,null,null,null,null,null,null,null,null,null,null,null,null,null,null,null,null,null,null,null,null,null,null,null,null,null,null,null,null,null,null,null,null,null,null,null,null,null,null,null,null,null,null,null,null,null,null,null,null,null,null,null,null,null,null,null,null,null,null,null,null,null,null,null,null,null,{"$f":"IF(GZ50=\"xx\",\"\",GZ50)","v":""},"","","","","","","","","","","","","","","","","","","","","",null,null,null,null,null,null,null,null,null,null,null,null,""]
[null,null,null,null,null,null,null,null,null,null,null,null,null,null,null,null,null,null,null,null,null,null,null,null,null,null,null,null,null,null,null,null,null,null,null,null,null,null,null,null,null,null,null,null,null,null,null,null,null,null,null,null,null,null,null,null,null,null,null,null,null,null,null,null,null,null,null,null,null,null,null,null,null,null,null,null,null,null,null,null,null,null,null,null,null,null,null,null,null,null,null,null,null,null,null,null,null,null,null,null,null,null,null,null,null,null,null,null,null,null,null,null,null,null,null,null,null,null,null,null,null,null,null,null,null,null,null,null,null,null,null,null,null,null,null,null,null,null,null,null,null,null,null,null,null,null,null,null,null,null,null,null,null,null,null,null,null,null,null,null,null,null,null,null,null,null,null,null,null,null,null,null,null,null,null,null,null,null,null,null,null,null,null,null,null,null,null,null,null,null,null,null,null,null,null,null,null,null,null,null,null,null,null,null,null,null,null,{"$f":"IF(GZ51=\"xx\",\"\",GZ51)","v":""},"","","","","","","","","","","",{"$f":"IF(HL51=\"xx\",\"\",HL51)","v":""},"","","","","","","","","",null,null,null,null,null,null,null,null,null,null,null,null,""]
[null,null,null,null,null,null,null,null,null,null,null,null,null,null,null,null,null,null,null,null,null,null,null,null,null,null,null,null,null,null,null,null,null,null,null,null,null,null,null,null,null,null,null,null,null,null,null,null,null,null,null,null,null,null,null,null,null,null,null,null,null,null,null,null,null,null,null,null,null,null,null,null,null,null,null,null,null,null,null,null,null,null,null,null,null,null,null,null,null,null,null,null,null,null,null,null,null,null,null,null,null,null,null,null,null,null,null,null,null,null,null,null,null,null,null,null,null,null,null,null,null,null,null,null,null,null,null,null,null,null,null,null,null,null,null,null,null,null,null,null,null,null,null,null,null,null,null,null,null,null,null,null,null,null,null,null,null,null,null,null,null,null,null,null,null,null,null,null,null,null,null,null,null,null,null,null,null,null,null,null,null,null,null,null,null,null,null,null,null,null,null,null,null,null,null,null,null,null,null,null,null,null,null,null,null,null,null,{"$f":"IF(GZ52=\"xx\",\"\",GZ52)","v":""},"","","","","","","","","","","","","","","","","","","","","",null,null,null,null,null,null,null,null,null,null,null,null,""]
[null,null,null,null,null,null,null,null,null,null,null,null,null,null,null,null,null,null,null,null,null,null,null,null,null,null,null,null,null,null,null,null,null,null,null,null,null,null,null,null,null,null,null,null,null,null,null,null,null,null,null,null,null,null,null,null,null,null,null,null,null,null,null,null,null,null,null,null,null,null,null,null,null,null,null,null,null,null,null,null,null,null,null,null,null,null,null,null,null,null,null,null,null,null,null,null,null,null,null,null,null,null,null,null,null,null,null,null,null,null,null,null,null,null,null,null,null,null,null,null,null,null,null,null,null,null,null,null,null,null,null,null,null,null,null,null,null,null,null,null,null,null,null,null,null,null,null,null,null,null,null,null,null,null,null,null,null,null,null,null,null,null,null,null,null,null,null,null,null,null,null,null,null,null,null,null,null,null,null,null,null,null,null,null,null,null,null,null,null,null,null,null,null,null,null,null,null,null,null,null,null,null,null,null,null,null,null,{"$f":"IF(GZ53=\"xx\",\"\",GZ53)","v":""},"","","","","","","","","","","","","","","","","","","","","",null,null,null,null,null,null,null,null,null,null,null,null,""]
[null,null,null,null,null,null,null,null,null,null,null,null,null,null,null,null,null,null,null,null,null,null,null,null,null,null,null,null,null,null,null,null,null,null,null,null,null,null,null,null,null,null,null,null,null,null,null,null,null,null,null,null,null,null,null,null,null,null,null,null,null,null,null,null,null,null,null,null,null,null,null,null,null,null,null,null,null,null,null,null,null,null,null,null,null,null,null,null,null,null,null,null,null,null,null,null,null,null,null,null,null,null,null,null,null,null,null,null,null,null,null,null,null,null,null,null,null,null,null,null,null,null,null,null,null,null,null,null,null,null,null,null,null,null,null,null,null,null,null,null,null,null,null,null,null,null,null,null,null,null,null,null,null,null,null,null,null,null,null,null,null,null,null,null,null,null,null,null,null,null,null,null,null,null,null,null,null,null,null,null,null,null,null,null,null,null,null,null,null,null,null,null,null,null,null,null,null,null,null,null,null,null,null,null,null,null,null,{"$f":"IF(GZ54=\"xx\",\"\",GZ54)","v":""},"","","","","","","","","","","","","","","","","","","","","",null,null,null,null,null,null,null,null,null,null,null,null,""]
[null,null,null,null,null,null,null,null,null,null,null,null,null,null,null,null,null,null,null,null,null,null,null,null,null,null,null,null,null,null,null,null,null,null,null,null,null,null,null,null,null,null,null,null,null,null,null,null,null,null,null,null,null,null,null,null,null,null,null,null,null,null,null,null,null,null,null,null,null,null,null,null,null,null,null,null,null,null,null,null,null,null,null,null,null,null,null,null,null,null,null,null,null,null,null,null,null,null,null,null,null,null,null,null,null,null,null,null,null,null,null,null,null,null,null,null,null,null,null,null,null,null,null,null,null,null,null,null,null,null,null,null,null,null,null,null,null,null,null,null,null,null,null,null,null,null,null,null,null,null,null,null,null,null,null,null,null,null,null,null,null,null,null,null,null,null,null,null,null,null,null,null,null,null,null,null,null,null,null,null,null,null,null,null,null,null,null,null,null,null,null,null,null,null,null,null,null,null,null,null,null,null,null,null,null,null,null,{"$f":"IF(GZ55=\"xx\",\"\",GZ55)","v":""},"","","","","","","","","","","","","","","","","","","","","",null,null,null,null,null,null,null,null,null,null,null,null,""]
[null,null,null,null,null,null,null,null,null,null,null,null,null,null,null,null,null,null,null,null,null,null,null,null,null,null,null,null,null,null,null,null,null,null,null,null,null,null,null,null,null,null,null,null,null,null,null,null,null,null,null,null,null,null,null,null,null,null,null,null,null,null,null,null,null,null,null,null,null,null,null,null,null,null,null,null,null,null,null,null,null,null,null,null,null,null,null,null,null,null,null,null,null,null,null,null,null,null,null,null,null,null,null,null,null,null,null,null,null,null,null,null,null,null,null,null,null,null,null,null,null,null,null,null,null,null,null,null,null,null,null,null,null,null,null,null,null,null,null,null,null,null,null,null,null,null,null,null,null,null,null,null,null,null,null,null,null,null,null,null,null,null,null,null,null,null,null,null,null,null,null,null,null,null,null,null,null,null,null,null,null,null,null,null,null,null,null,null,null,null,null,null,null,null,null,null,null,null,null,null,null,null,null,null,null,null,null,{"$f":"IF(GZ56=\"xx\",\"\",GZ56)","v":""},"","","","","","","","","","","","","","","","","","","","","",null,null,null,null,null,null,null,null,null,null,null,null,""]
[null,null,null,null,null,null,null,null,null,null,null,null,null,null,null,null,null,null,null,null,null,null,null,null,null,null,null,null,null,null,null,null,null,null,null,null,null,null,null,null,null,null,null,null,null,null,null,null,null,null,null,null,null,null,null,null,null,null,null,null,null,null,null,null,null,null,null,null,null,null,null,null,null,null,null,null,null,null,null,null,null,null,null,null,null,null,null,null,null,null,null,null,null,null,null,null,null,null,null,null,null,null,null,null,null,null,null,null,null,null,null,null,null,null,null,null,null,null,null,null,null,null,null,null,null,null,null,null,null,null,null,null,null,null,null,null,null,null,null,null,null,null,null,null,null,null,null,null,null,null,null,null,null,null,null,null,null,null,null,null,null,null,null,null,null,null,null,null,null,null,null,null,null,null,null,null,null,null,null,null,null,null,null,null,null,null,null,null,null,null,null,null,null,null,null,null,null,null,null,null,null,null,null,null,null,null,null,{"$f":"IF(GZ57=\"xx\",\"\",GZ57)","v":""},"","","","","","","","","","","","","","","","","","","","","",null,null,null,null,null,null,null,null,null,null,null,null,""]
[null,null,null,null,null,null,null,null,null,null,null,null,null,null,null,null,null,null,null,null,null,null,null,null,null,null,null,null,null,null,null,null,null,null,null,null,null,null,null,null,null,null,null,null,null,null,null,null,null,null,null,null,null,null,null,null,null,null,null,null,null,null,null,null,null,null,null,null,null,null,null,null,null,null,null,null,null,null,null,null,null,null,null,null,null,null,null,null,null,null,null,null,null,null,null,null,null,null,null,null,null,null,null,null,null,null,null,null,null,null,null,null,null,null,null,null,null,null,null,null,null,null,null,null,null,null,null,null,null,null,null,null,null,null,null,null,null,null,null,null,null,null,null,null,null,null,null,null,null,null,null,null,null,null,null,null,null,null,null,null,null,null,null,null,null,null,null,null,null,null,null,null,null,null,null,null,null,null,null,null,null,null,null,null,null,null,null,null,null,null,null,null,null,null,null,null,null,null,null,null,null,null,null,null,null,null,null,{"$f":"IF(GZ58=\"xx\",\"\",GZ58)","v":""},"","","","","","","","","","","","","","","","","","","","","",null,null,null,null,null,null,null,null,null,null,null,null,""]
[null,null,null,null,null,null,null,null,null,null,null,null,null,null,null,null,null,null,null,null,null,null,null,null,null,null,null,null,null,null,null,null,null,null,null,null,null,null,null,null,null,null,null,null,null,null,null,null,null,null,null,null,null,null,null,null,null,null,null,null,null,null,null,null,null,null,null,null,null,null,null,null,null,null,null,null,null,null,null,null,null,null,null,null,null,null,null,null,null,null,null,null,null,null,null,null,null,null,null,null,null,null,null,null,null,null,null,null,null,null,null,null,null,null,null,null,null,null,null,null,null,null,null,null,null,null,null,null,null,null,null,null,null,null,null,null,null,null,null,null,null,null,null,null,null,null,null,null,null,null,null,null,null,null,null,null,null,null,null,null,null,null,null,null,null,null,null,null,null,null,null,null,null,null,null,null,null,null,null,null,null,null,null,null,null,null,null,null,null,null,null,null,null,null,null,null,null,null,null,null,null,null,null,null,null,null,null,{"$f":"IF(GZ59=\"xx\",\"\",GZ59)","v":""},"","","","","","","","","","","","","","","","","","","","","",null,null,null,null,null,null,null,null,null,null,null,null,""]
[null,null,null,null,null,null,null,null,null,null,null,null,null,null,null,null,null,null,null,null,null,null,null,null,null,null,null,null,null,null,null,null,null,null,null,null,null,null,null,null,null,null,null,null,null,null,null,null,null,null,null,null,null,null,null,null,null,null,null,null,null,null,null,null,null,null,null,null,null,null,null,null,null,null,null,null,null,null,null,null,null,null,null,null,null,null,null,null,null,null,null,null,null,null,null,null,null,null,null,null,null,null,null,null,null,null,null,null,null,null,null,null,null,null,null,null,null,null,null,null,null,null,null,null,null,null,null,null,null,null,null,null,null,null,null,null,null,null,null,null,null,null,null,null,null,null,null,null,null,null,null,null,null,null,null,null,null,null,null,null,null,null,null,null,null,null,null,null,null,null,null,null,null,null,null,null,null,null,null,null,null,null,null,null,null,null,null,null,null,null,null,null,null,null,null,null,null,null,null,null,null,null,null,null,null,null,null,{"$f":"IF(GZ60=\"xx\",\"\",GZ60)","v":""},"","","","","","","","","","","","","","","","","","","","","",null,null,null,null,null,null,null,null,null,null,null,null,""]
[null,null,null,null,null,null,null,null,null,null,null,null,null,null,null,null,null,null,null,null,null,null,null,null,null,null,null,null,null,null,null,null,null,null,null,null,null,null,null,null,null,null,null,null,null,null,null,null,null,null,null,null,null,null,null,null,null,null,null,null,null,null,null,null,null,null,null,null,null,null,null,null,null,null,null,null,null,null,null,null,null,null,null,null,null,null,null,null,null,null,null,null,null,null,null,null,null,null,null,null,null,null,null,null,null,null,null,null,null,null,null,null,null,null,null,null,null,null,null,null,null,null,null,null,null,null,null,null,null,null,null,null,null,null,null,null,null,null,null,null,null,null,null,null,null,null,null,null,null,null,null,null,null,null,null,null,null,null,null,null,null,null,null,null,null,null,null,null,null,null,null,null,null,null,null,null,null,null,null,null,null,null,null,null,null,null,null,null,null,null,null,null,null,null,null,null,null,null,null,null,null,null,null,null,null,null,null,{"$f":"IF(GZ61=\"xx\",\"\",GZ61)","v":""},"","","","","","","","","","","","","","","","","","","","","",null,null,null,null,null,null,null,null,null,null,null,null,""]
[null,null,null,null,null,null,null,null,null,null,null,null,null,null,null,null,null,null,null,null,null,null,null,null,null,null,null,null,null,null,null,null,null,null,null,null,null,null,null,null,null,null,null,null,null,null,null,null,null,null,null,null,null,null,null,null,null,null,null,null,null,null,null,null,null,null,null,null,null,null,null,null,null,null,null,null,null,null,null,null,null,null,null,null,null,null,null,null,null,null,null,null,null,null,null,null,null,null,null,null,null,null,null,null,null,null,null,null,null,null,null,null,null,null,null,null,null,null,null,null,null,null,null,null,null,null,null,null,null,null,null,null,null,null,null,null,null,null,null,null,null,null,null,null,null,null,null,null,null,null,null,null,null,null,null,null,null,null,null,null,null,null,null,null,null,null,null,null,null,null,null,null,null,null,null,null,null,null,null,null,null,null,null,null,null,null,null,null,null,null,null,null,null,null,null,null,null,null,null,null,null,null,null,null,null,null,null,{"$f":"IF(GZ62=\"xx\",\"\",GZ62)","v":""},"","","","","","","","","","","","","","","","","","","","","",null,null,null,null,null,null,null,null,null,null,null,null,""]
[null,null,null,null,null,null,null,null,null,null,null,null,null,null,null,null,null,null,null,null,null,null,null,null,null,null,null,null,null,null,null,null,null,null,null,null,null,null,null,null,null,null,null,null,null,null,null,null,null,null,null,null,null,null,null,null,null,null,null,null,null,null,null,null,null,null,null,null,null,null,null,null,null,null,null,null,null,null,null,null,null,null,null,null,null,null,null,null,null,null,null,null,null,null,null,null,null,null,null,null,null,null,null,null,null,null,null,null,null,null,null,null,null,null,null,null,null,null,null,null,null,null,null,null,null,null,null,null,null,null,null,null,null,null,null,null,null,null,null,null,null,null,null,null,null,null,null,null,null,null,null,null,null,null,null,null,null,null,null,null,null,null,null,null,null,null,null,null,null,null,null,null,null,null,null,null,null,null,null,null,null,null,null,null,null,null,null,null,null,null,null,null,null,null,null,null,null,null,null,null,null,null,null,null,null,null,null,{"$f":"IF(GZ63=\"xx\",\"\",GZ63)","v":""},"","","","","","","","","","","","","","","","","","","","","",null,null,null,null,null,null,null,null,null,null,null,null,""]
[null,null,null,null,null,null,null,null,null,null,null,null,null,null,null,null,null,null,null,null,null,null,null,null,null,null,null,null,null,null,null,null,null,null,null,null,null,null,null,null,null,null,null,null,null,null,null,null,null,null,null,null,null,null,null,null,null,null,null,null,null,null,null,null,null,null,null,null,null,null,null,null,null,null,null,null,null,null,null,null,null,null,null,null,null,null,null,null,null,null,null,null,null,null,null,null,null,null,null,null,null,null,null,null,null,null,null,null,null,null,null,null,null,null,null,null,null,null,null,null,null,null,null,null,null,null,null,null,null,null,null,null,null,null,null,null,null,null,null,null,null,null,null,null,null,null,null,null,null,null,null,null,null,null,null,null,null,null,null,null,null,null,null,null,null,null,null,null,null,null,null,null,null,null,null,null,null,null,null,null,null,null,null,null,null,null,null,null,null,null,null,null,null,null,null,null,null,null,null,null,null,null,null,null,null,null,null,{"$f":"IF(GZ64=\"xx\",\"\",GZ64)","v":""},"","","","","","","","","","","","","","","","","","","","","",null,null,null,null,null,null,null,null,null,null,null,null,""]
[null,null,null,null,null,null,null,null,null,null,null,null,null,null,null,null,null,null,null,null,null,null,null,null,null,null,null,null,null,null,null,null,null,null,null,null,null,null,null,null,null,null,null,null,null,null,null,null,null,null,null,null,null,null,null,null,null,null,null,null,null,null,null,null,null,null,null,null,null,null,null,null,null,null,null,null,null,null,null,null,null,null,null,null,null,null,null,null,null,null,null,null,null,null,null,null,null,null,null,null,null,null,null,null,null,null,null,null,null,null,null,null,null,null,null,null,null,null,null,null,null,null,null,null,null,null,null,null,null,null,null,null,null,null,null,null,null,null,null,null,null,null,null,null,null,null,null,null,null,null,null,null,null,null,null,null,null,null,null,null,null,null,null,null,null,null,null,null,null,null,null,null,null,null,null,null,null,null,null,null,null,null,null,null,null,null,null,null,null,null,null,null,null,null,null,null,null,null,null,null,null,null,null,null,null,null,null,{"$f":"IF(GZ65=\"xx\",\"\",GZ65)","v":""},"","","","","","","","","","","","","","","","","","","","","",null,null,null,null,null,null,null,null,null,null,null,null,""]
[null,null,null,null,null,null,null,null,null,null,null,null,null,null,null,null,null,null,null,null,null,null,null,null,null,null,null,null,null,null,null,null,null,null,null,null,null,null,null,null,null,null,null,null,null,null,null,null,null,null,null,null,null,null,null,null,null,null,null,null,null,null,null,null,null,null,null,null,null,null,null,null,null,null,null,null,null,null,null,null,null,null,null,null,null,null,null,null,null,null,null,null,null,null,null,null,null,null,null,null,null,null,null,null,null,null,null,null,null,null,null,null,null,null,null,null,null,null,null,null,null,null,null,null,null,null,null,null,null,null,null,null,null,null,null,null,null,null,null,null,null,null,null,null,null,null,null,null,null,null,null,null,null,null,null,null,null,null,null,null,null,null,null,null,null,null,null,null,null,null,null,null,null,null,null,null,null,null,null,null,null,null,null,null,null,null,null,null,null,null,null,null,null,null,null,null,null,null,null,null,null,null,null,null,null,null,null,{"$f":"IF(GZ66=\"xx\",\"\",GZ66)","v":""},"","","","","","","","","","","","","","","","","","","","","",null,null,null,null,null,null,null,null,null,null,null,null,""]
[null,null,null,null,null,null,null,null,null,null,null,null,null,null,null,null,null,null,null,null,null,null,null,null,null,null,null,null,null,null,null,null,null,null,null,null,null,null,null,null,null,null,null,null,null,null,null,null,null,null,null,null,null,null,null,null,null,null,null,null,null,null,null,null,null,null,null,null,null,null,null,null,null,null,null,null,null,null,null,null,null,null,null,null,null,null,null,null,null,null,null,null,null,null,null,null,null,null,null,null,null,null,null,null,null,null,null,null,null,null,null,null,null,null,null,null,null,null,null,null,null,null,null,null,null,null,null,null,null,null,null,null,null,null,null,null,null,null,null,null,null,null,null,null,null,null,null,null,null,null,null,null,null,null,null,null,null,null,null,null,null,null,null,null,null,null,null,null,null,null,null,null,null,null,null,null,null,null,null,null,null,null,null,null,null,null,null,null,null,null,null,null,null,null,null,null,null,null,null,null,null,null,null,null,null,null,null,{"$f":"IF(GZ67=\"xx\",\"\",GZ67)","v":""},"","","","","","","","","","","","","","","","","","","","","",null,null,null,null,null,null,null,null,null,null,null,null,""]
[null,null,null,null,null,null,null,null,null,null,null,null,null,null,null,null,null,null,null,null,null,null,null,null,null,null,null,null,null,null,null,null,null,null,null,null,null,null,null,null,null,null,null,null,null,null,null,null,null,null,null,null,null,null,null,null,null,null,null,null,null,null,null,null,null,null,null,null,null,null,null,null,null,null,null,null,null,null,null,null,null,null,null,null,null,null,null,null,null,null,null,null,null,null,null,null,null,null,null,null,null,null,null,null,null,null,null,null,null,null,null,null,null,null,null,null,null,null,null,null,null,null,null,null,null,null,null,null,null,null,null,null,null,null,null,null,null,null,null,null,null,null,null,null,null,null,null,null,null,null,null,null,null,null,null,null,null,null,null,null,null,null,null,null,null,null,null,null,null,null,null,null,null,null,null,null,null,null,null,null,null,null,null,null,null,null,null,null,null,null,null,null,null,null,null,null,null,null,null,null,null,null,null,null,null,null,null,{"$f":"IF(GZ68=\"xx\",\"\",GZ68)","v":""},"","","","","","","","","","","","","","","","","","","","","",null,null,null,null,null,null,null,null,null,null,null,null,""]
[null,null,null,null,null,null,null,null,null,null,null,null,null,null,null,null,null,null,null,null,null,null,null,null,null,null,null,null,null,null,null,null,null,null,null,null,null,null,null,null,null,null,null,null,null,null,null,null,null,null,null,null,null,null,null,null,null,null,null,null,null,null,null,null,null,null,null,null,null,null,null,null,null,null,null,null,null,null,null,null,null,null,null,null,null,null,null,null,null,null,null,null,null,null,null,null,null,null,null,null,null,null,null,null,null,null,null,null,null,null,null,null,null,null,null,null,null,null,null,null,null,null,null,null,null,null,null,null,null,null,null,null,null,null,null,null,null,null,null,null,null,null,null,null,null,null,null,null,null,null,null,null,null,null,null,null,null,null,null,null,null,null,null,null,null,null,null,null,null,null,null,null,null,null,null,null,null,null,null,null,null,null,null,null,null,null,null,null,null,null,null,null,null,null,null,null,null,null,null,null,null,null,null,null,null,null,null,{"$f":"IF(GZ69=\"xx\",\"\",GZ69)","v":""},"","","","","","","","","","","","","","","","","","","","","",null,null,null,null,null,null,null,null,null,null,null,null,""]
[]
[]
[]
[]
[]
[]
[]
[]
[]
[]
[]
[null,null,null,null,null,null,null,null,null,null,null,null,null,null,null,null,null,null,null,null,null,null,null,null,null,null,null,null,null,null,null,null,null,null,null,null,null,null,null,null,null,null,null,null,null,null,null,null,null,null,null,null,null,null,null,null,null,null,null,null,null,null,null,null,null,null,null,null,null,null,null,null,null,null,null,null,null,null,null,null,null,null,null,null,null,null,null,null,null,null,null,null,null,null,null,null,null,null,null,null,null,null,null,null,null,null,null,null,null,null,null,null,null,null,null,null,null,null,null,null,null,null,null,null,null,null,null,null,null,null,null,null,null,null,null,null,null,null,null,null,null,null,null,null,null,null,null,null,null,null,null,null,null,null,null,null,null,null,null,null,null,null,null,null,null,null,null,null,null,null,null,null,null,null,null,null,null,null,null,null,null,null,null,null,null,null,null,null,null,null,null,null,null,null,null,null,null,null,null,null,null,null,null,null,null,null,null,{"$f":"IF(GZ81=\"xx\",\"\",GZ81)","v":""},"","","","","","","","","","","","","","","","","","","","","",null,null,null,null,null,null,null,null,null,null,null,null,""]
[null,null,null,null,null,null,null,null,null,null,null,null,null,null,null,null,null,null,null,null,null,null,null,null,null,null,null,null,null,null,null,null,null,null,null,null,null,null,null,null,null,null,null,null,null,null,null,null,null,null,null,null,null,null,null,null,null,null,null,null,null,null,null,null,null,null,null,null,null,null,null,null,null,null,null,null,null,null,null,null,null,null,null,null,null,null,null,null,null,null,null,null,null,null,null,null,null,null,null,null,null,null,null,null,null,null,null,null,null,null,null,null,null,null,null,null,null,null,null,null,null,null,null,null,null,null,null,null,null,null,null,null,null,null,null,null,null,null,null,null,null,null,null,null,null,null,null,null,null,null,null,null,null,null,null,null,null,null,null,null,null,null,null,null,null,null,null,null,null,null,null,null,null,null,null,null,null,null,null,null,null,null,null,null,null,null,null,null,null,null,null,null,null,null,null,null,null,null,null,null,null,null,null,null,null,null,null,{"$f":"IF(GZ82=\"xx\",\"\",GZ82)","v":""},"","","","","","","","","","","","","","","","","","","","","",null,null,null,null,null,null,null,null,null,null,null,null,""]
[null,null,null,null,null,null,null,null,null,null,null,null,null,null,null,null,null,null,null,null,null,null,null,null,null,null,null,null,null,null,null,null,null,null,null,null,null,null,null,null,null,null,null,null,null,null,null,null,null,null,null,null,null,null,null,null,null,null,null,null,null,null,null,null,null,null,null,null,null,null,null,null,null,null,null,null,null,null,null,null,null,null,null,null,null,null,null,null,null,null,null,null,null,null,null,null,null,null,null,null,null,null,null,null,null,null,null,null,null,null,null,null,null,null,null,null,null,null,null,null,null,null,null,null,null,null,null,null,null,null,null,null,null,null,null,null,null,null,null,null,null,null,null,null,null,null,null,null,null,null,null,null,null,null,null,null,null,null,null,null,null,null,null,null,null,null,null,null,null,null,null,null,null,null,null,null,null,null,null,null,null,null,null,null,null,null,null,null,null,null,null,null,null,null,null,null,null,null,null,null,null,null,null,null,null,null,null,{"$f":"IF(GZ83=\"xx\",\"\",GZ83)","v":""},"","","","","","","","","","","","","","","","","","","","","",null,null,null,null,null,null,null,null,null,null,null,null,""]
[null,null,null,null,null,null,null,null,null,null,null,null,null,null,null,null,null,null,null,null,null,null,null,null,null,null,null,null,null,null,null,null,null,null,null,null,null,null,null,null,null,null,null,null,null,null,null,null,null,null,null,null,null,null,null,null,null,null,null,null,null,null,null,null,null,null,null,null,null,null,null,null,null,null,null,null,null,null,null,null,null,null,null,null,null,null,null,null,null,null,null,null,null,null,null,null,null,null,null,null,null,null,null,null,null,null,null,null,null,null,null,null,null,null,null,null,null,null,null,null,null,null,null,null,null,null,null,null,null,null,null,null,null,null,null,null,null,null,null,null,null,null,null,null,null,null,null,null,null,null,null,null,null,null,null,null,null,null,null,null,null,null,null,null,null,null,null,null,null,null,null,null,null,null,null,null,null,null,null,null,null,null,null,null,null,null,null,null,null,null,null,null,null,null,null,null,null,null,null,null,null,null,null,null,null,null,null,{"$f":"IF(GZ84=\"xx\",\"\",GZ84)","v":""},"","","","","","","","","","","","","","","","","","","","","",null,null,null,null,null,null,null,null,null,null,null,null,""]
[null,null,null,null,null,null,null,null,null,null,null,null,null,null,null,null,null,null,null,null,null,null,null,null,null,null,null,null,null,null,null,null,null,null,null,null,null,null,null,null,null,null,null,null,null,null,null,null,null,null,null,null,null,null,null,null,null,null,null,null,null,null,null,null,null,null,null,null,null,null,null,null,null,null,null,null,null,null,null,null,null,null,null,null,null,null,null,null,null,null,null,null,null,null,null,null,null,null,null,null,null,null,null,null,null,null,null,null,null,null,null,null,null,null,null,null,null,null,null,null,null,null,null,null,null,null,null,null,null,null,null,null,null,null,null,null,null,null,null,null,null,null,null,null,null,null,null,null,null,null,null,null,null,null,null,null,null,null,null,null,null,null,null,null,null,null,null,null,null,null,null,null,null,null,null,null,null,null,null,null,null,null,null,null,null,null,null,null,null,null,null,null,null,null,null,null,null,null,null,null,null,null,null,null,null,null,null,{"$f":"IF(GZ85=\"xx\",\"\",GZ85)","v":""},"","","","","","","","","","","","","","","","","","","","","",null,null,null,null,null,null,null,null,null,null,null,null,""]
[null,null,null,null,null,null,null,null,null,null,null,null,null,null,null,null,null,null,null,null,null,null,null,null,null,null,null,null,null,null,null,null,null,null,null,null,null,null,null,null,null,null,null,null,null,null,null,null,null,null,null,null,null,null,null,null,null,null,null,null,null,null,null,null,null,null,null,null,null,null,null,null,null,null,null,null,null,null,null,null,null,null,null,null,null,null,null,null,null,null,null,null,null,null,null,null,null,null,null,null,null,null,null,null,null,null,null,null,null,null,null,null,null,null,null,null,null,null,null,null,null,null,null,null,null,null,null,null,null,null,null,null,null,null,null,null,null,null,null,null,null,null,null,null,null,null,null,null,null,null,null,null,null,null,null,null,null,null,null,null,null,null,null,null,null,null,null,null,null,null,null,null,null,null,null,null,null,null,null,null,null,null,null,null,null,null,null,null,null,null,null,null,null,null,null,null,null,null,null,null,null,null,null,null,null,null,null,{"$f":"IF(GZ86=\"xx\",\"\",GZ86)","v":""},"","","","","","","","","","","","","","","","","","","","","",null,null,null,null,null,null,null,null,null,null,null,null,""]
[null,null,null,null,null,null,null,null,null,null,null,null,null,null,null,null,null,null,null,null,null,null,null,null,null,null,null,null,null,null,null,null,null,null,null,null,null,null,null,null,null,null,null,null,null,null,null,null,null,null,null,null,null,null,null,null,null,null,null,null,null,null,null,null,null,null,null,null,null,null,null,null,null,null,null,null,null,null,null,null,null,null,null,null,null,null,null,null,null,null,null,null,null,null,null,null,null,null,null,null,null,null,null,null,null,null,null,null,null,null,null,null,null,null,null,null,null,null,null,null,null,null,null,null,null,null,null,null,null,null,null,null,null,null,null,null,null,null,null,null,null,null,null,null,null,null,null,null,null,null,null,null,null,null,null,null,null,null,null,null,null,null,null,null,null,null,null,null,null,null,null,null,null,null,null,null,null,null,null,null,null,null,null,null,null,null,null,null,null,null,null,null,null,null,null,null,null,null,null,null,null,null,null,null,null,null,null,{"$f":"IF(GZ87=\"xx\",\"\",GZ87)","v":""},"","","","","","","","","","","","","","","","","","","","","",null,null,null,null,null,null,null,null,null,null,null,null,""]
[null,null,null,null,null,null,null,null,null,null,null,null,null,null,null,null,null,null,null,null,null,null,null,null,null,null,null,null,null,null,null,null,null,null,null,null,null,null,null,null,null,null,null,null,null,null,null,null,null,null,null,null,null,null,null,null,null,null,null,null,null,null,null,null,null,null,null,null,null,null,null,null,null,null,null,null,null,null,null,null,null,null,null,null,null,null,null,null,null,null,null,null,null,null,null,null,null,null,null,null,null,null,null,null,null,null,null,null,null,null,null,null,null,null,null,null,null,null,null,null,null,null,null,null,null,null,null,null,null,null,null,null,null,null,null,null,null,null,null,null,null,null,null,null,null,null,null,null,null,null,null,null,null,null,null,null,null,null,null,null,null,null,null,null,null,null,null,null,null,null,null,null,null,null,null,null,null,null,null,null,null,null,null,null,null,null,null,null,null,null,null,null,null,null,null,null,null,null,null,null,null,null,null,null,null,null,null,{"$f":"IF(GZ88=\"xx\",\"\",GZ88)","v":""},"","","","","","","","","","","","","","","","","","","","","",null,null,null,null,null,null,null,null,null,null,null,null,""]

{"sheet":"Karaktermatrice","index":3,"n_rows":73,"n_cols":32,"rows_kept":73,"cut":false,"hidden":true,"merged":[]}
[null,null,null,null,null,null,1,2,3,4,5,6,7,8,9,10,11,12,13,14,15,16,17,18,19,20,21,22,23,24,25]
["Basis valg",null,null,null,null,"Efterafgrøde","Index","Efterafgrøde - karakter","Mellemafgrøde - karakter","MFO i blanding - karakter","MFO udlæg - karakter","Egnet til udlæg efterår i vinterkorn","Egnet til udlæg forår","Egnet til udsåning 2-3 uger før høst","Egnet til udsåning efter tidlig høst (10. august)","Efterafgrøde","Mellemafgrøde","MFO i blanding","MFO i udlæg","MFO total","Opformere ikke kålbrok ","Egen udsæd lovlig?","Default","Sys","Plads","Ok ifht. Kålbrok (Hvis det er valgt at der ikke må opformeres kålbrok vises kun afgrøde hvor der findes ok sorter) ","Ok ifht egen udsæd(hvis det er valg at det skal kunne anvendes?)","Kan etableres på valgt tidspunkt","Er godkendt afgrøde","Med?","Index","Efterafgrøde"]
["Lovkrav","Valg i frontend","Konsekvens",null,null,"Alm. rajgræs, dipl., udlæg",1,{"$f":"Grundkarakterer!H8","v":1},{"$f":"Grundkarakterer!I8","v":0},{"$f":"Grundkarakterer!J8","v":0},{"$f":"Grundkarakterer!K8","v":1},{"$f":"Grundkarakterer!O8","v":0},{"$f":"Grundkarakterer!P8","v":3},{"$f":"Grundkarakterer!Q8","v":1},{"$f":"Grundkarakterer!Q8","v":1},{"$f":"IF(OR($C$4=1,$C$5=1),Grundkarakterer!H8,0)","v":0},{"$f":"IF(C$7=1,Grundkarakterer!I8,0)","v":0},{"$f":"IF(OR(C$5=1,C$6=1),Grundkarakterer!J8,0)","v":0},{"$f":"IF(OR(C$5=1,C$6=1),Grundkarakterer!K8,0)","v":0},{"$f":"SUM(R3:S3)","v":0},{"$f":"Grundkarakterer!W8","v":3},{"$f":"Grundkarakterer!AA8","v":0},34,{"$f":"W3/($G$36+1)+P3+Q3+T3","v":0.97142857142857142},{"$f":"_xlfn.RANK.EQ(X3,X$3:X$36,0)","v":1},{"$f":"IF(AND(U3=0,C$26=1),\"Nej\",\"Ja\")","v":"Ja"},{"$f":"IF(AND(V3=0,C$27=1),\"Nej\",\"Ja\")","v":"Ja"},{"$f":"IF(C$21=1,IF(L3>0,\"Ja\",\"Nej\"),IF(C$22=1,IF(M3>0,\"Ja\",\"Nej\"),IF(C$23=1,IF(N3>0,\"Ja\",\"Nej\"),IF(C$24=1,IF(O3>0,\"Ja\",\"Nej\")))))","v":false},{"$f":"IF( $C$9=0,\"Ja\",IF(X3>=$C$9,\"Ja\",\"Nej\"))","v":"Nej"},{"$f":"IF(AND(AB3=\"Ja\",AC3=\"Ja\",Z3=\"Ja\",AA3=\"Ja\"),\"Ja\",\"Nej\")","v":"Nej"},{"$f":"(IF(MATCH(G3,$Y$3:$Y$36,0)=\"xx\",\"xx\",MATCH(G3,$Y$3:$Y$36,0)))","v":1},{"$f":"INDEX(Grundkarakterer!$B$8:$B$41,AE3)","v":"Alm. rajgræs, dipl., udlæg"}]
["Pligtig efterafgrøde",{"$f":"IF('Efterafgrøde beslutningsstøtte'!A$7=\"Vælg funktion\",\"xx\",IF('Efterafgrøde beslutningsstøtte'!A$7=Karaktermatrice!A4,1,0))","v":"xx"},{"$f":"IF(B4=\"xx\",\"xx\",B4)","v":"xx"},null,null,"Ital. rajgræs, dipl., udlæg",2,{"$f":"Grundkarakterer!H9","v":1},{"$f":"Grundkarakterer!I9","v":0},{"$f":"Grundkarakterer!J9","v":0},{"$f":"Grundkarakterer!K9","v":1},{"$f":"Grundkarakterer!O9","v":0},{"$f":"Grundkarakterer!P9","v":0},{"$f":"Grundkarakterer!Q9","v":1},{"$f":"Grundkarakterer!Q9","v":1},{"$f":"IF(OR($C$4=1,$C$5=1),Grundkarakterer!H9,0)","v":0},{"$f":"IF(C$7=1,Grundkarakterer!I9,0)","v":0},{"$f":"IF(OR(C$5=1,C$6=1),Grundkarakterer!J9,0)","v":0},{"$f":"IF(OR(C$5=1,C$6=1),Grundkarakterer!K9,0)","v":0},{"$f":"SUM(R4:S4)","v":0},{"$f":"Grundkarakterer!W9","v":3},{"$f":"Grundkarakterer!AA9","v":0},33,0.94285714285714284,2,"Ja",{"$f":"IF(AND(V4=0,C$27=1),\"Nej\",\"Ja\")","v":"Ja"},false,"Nej","Nej",2,{"$f":"INDEX(Grundkarakterer!$B$8:$B$41,AE4)","v":"Ital. rajgræs, dipl., udlæg"}]
["Pligtig efterafgrøde og MFO afgrøde",{"$f":"IF('Efterafgrøde beslutningsstøtte'!A$7=\"Vælg funktion\",\"xx\",IF('Efterafgrøde beslutningsstøtte'!A$7=Karaktermatrice!A5,1,0))","v":"xx"},{"$f":"IF(B5=\"xx\",\"xx\",B5)","v":"xx"},null,null,"Westerwoldisk rajgræs",3,{"$f":"Grundkarakterer!H10","v":1},{"$f":"Grundkarakterer!I10","v":0},{"$f":"Grundkarakterer!J10","v":0},{"$f":"Grundkarakterer!K10","v":1},{"$f":"Grundkarakterer!O10","v":0},{"$f":"Grundkarakterer!P10","v":0},{"$f":"Grundkarakterer!Q10","v":0},{"$f":"Grundkarakterer!Q10","v":0},{"$f":"IF(OR($C$4=1,$C$5=1),Grundkarakterer!H10,0)","v":0},{"$f":"IF(C$7=1,Grundkarakterer!I10,0)","v":0},{"$f":"IF(OR(C$5=1,C$6=1),Grundkarakterer!J10,0)","v":0},{"$f":"IF(OR(C$5=1,C$6=1),Grundkarakterer!K10,0)","v":0},0,{"$f":"Grundkarakterer!W10","v":3},{"$f":"Grundkarakterer!AA10","v":0},32,0.91428571428571426,3,"Ja","Ja",false,"Nej","Nej",3,{"$f":"INDEX(Grundkarakterer!$B$8:$B$41,AE5)","v":"Westerwoldisk rajgræs"}]
["Kun MFO afgrøde",{"$f":"IF('Efterafgrøde beslutningsstøtte'!A$7=\"Vælg funktion\",\"xx\",IF('Efterafgrøde beslutningsstøtte'!A$7=Karaktermatrice!A6,1,0))","v":"xx"},{"$f":"IF(B6=\"xx\",\"xx\",B6)","v":"xx"},null,null,"Strandsvingel, udlæg",4,{"$f":"Grundkarakterer!H11","v":1},{"$f":"Grundkarakterer!I11","v":0},{"$f":"Grundkarakterer!J11","v":0},{"$f":"Grundkarakterer!K11","v":1},{"$f":"Grundkarakterer!O11","v":1},{"$f":"Grundkarakterer!P11","v":3},{"$f":"Grundkarakterer!Q11","v":0},{"$f":"Grundkarakterer!Q11","v":0},{"$f":"IF(OR($C$4=1,$C$5=1),Grundkarakterer!H11,0)","v":0},{"$f":"IF(C$7=1,Grundkarakterer!I11,0)","v":0},{"$f":"IF(OR(C$5=1,C$6=1),Grundkarakterer!J11,0)","v":0},{"$f":"IF(OR(C$5=1,C$6=1),Grundkarakterer!K11,0)","v":0},0,{"$f":"Grundkarakterer!W11","v":3},{"$f":"Grundkarakterer!AA11","v":0},31,0.88571428571428568,4,"Ja","Ja",false,"Nej","Nej",4,{"$f":"INDEX(Grundkarakterer!$B$8:$B$41,AE6)","v":"Strandsvingel, udlæg"}]
["Pligtig mellemafgrøde",{"$f":"IF('Efterafgrøde beslutningsstøtte'!A$7=\"Vælg funktion\",\"xx\",IF('Efterafgrøde beslutningsstøtte'!A$7=Karaktermatrice!A7,1,0))","v":"xx"},{"$f":"IF(B7=\"xx\",\"xx\",B7)","v":"xx"},null,null,"Rødsvingel, udlæg",5,{"$f":"Grundkarakterer!H12","v":1},{"$f":"Grundkarakterer!I12","v":0},{"$f":"Grundkarakterer!J12","v":0},{"$f":"Grundkarakterer!K12","v":1},{"$f":"Grundkarakterer!O12","v":1},{"$f":"Grundkarakterer!P12","v":3},{"$f":"Grundkarakterer!Q12","v":0},{"$f":"Grundkarakterer!Q12","v":0},{"$f":"IF(OR($C$4=1,$C$5=1),Grundkarakterer!H12,0)","v":0},{"$f":"IF(C$7=1,Grundkarakterer!I12,0)","v":0},{"$f":"IF(OR(C$5=1,C$6=1),Grundkarakterer!J12,0)","v":0},{"$f":"IF(OR(C$5=1,C$6=1),Grundkarakterer!K12,0)","v":0},0,{"$f":"Grundkarakterer!W12","v":3},{"$f":"Grundkarakterer!AA12","v":0},30,0.8571428571428571,5,"Ja","Ja",false,"Nej","Nej",5,{"$f":"INDEX(Grundkarakterer!$B$8:$B$41,AE7)","v":"Rødsvingel, udlæg"}]
["Frivillig efterafgrøde",{"$f":"IF('Efterafgrøde beslutningsstøtte'!A$7=\"Vælg funktion\",\"xx\",IF('Efterafgrøde beslutningsstøtte'!A$7=Karaktermatrice!A8,1,0))","v":"xx"},{"$f":"IF(B8=\"xx\",\"xx\",IF(B8=1,0,0))","v":"xx"},null,null,"Engrapgræs, udlæg",6,{"$f":"Grundkarakterer!H13","v":1},{"$f":"Grundkarakterer!I13","v":0},{"$f":"Grundkarakterer!J13","v":0},{"$f":"Grundkarakterer!K13","v":1},{"$f":"Grundkarakterer!O13","v":0},{"$f":"Grundkarakterer!P13","v":2},{"$f":"Grundkarakterer!Q13","v":0},{"$f":"Grundkarakterer!Q13","v":0},{"$f":"IF(OR($C$4=1,$C$5=1),Grundkarakterer!H13,0)","v":0},{"$f":"IF(C$7=1,Grundkarakterer!I13,0)","v":0},{"$f":"IF(OR(C$5=1,C$6=1),Grundkarakterer!J13,0)","v":0},{"$f":"IF(OR(C$5=1,C$6=1),Grundkarakterer!K13,0)","v":0},0,{"$f":"Grundkarakterer!W13","v":3},{"$f":"Grundkarakterer!AA13","v":0},29,0.82857142857142863,6,"Ja","Ja",false,"Nej","Nej",6,{"$f":"INDEX(Grundkarakterer!$B$8:$B$41,AE8)","v":"Engrapgræs, udlæg"}]
["SUM",null,{"$f":"IF(AND(C4=\"xx\",C5=\"xx\",C6=\"xx\",C7=\"xx\",C8=\"xx\"),\"xx\",IF(C5=1,SUM(C4:C8)+1,SUM(C4:C8)))","v":"xx"},null,null,"Hundegræs, udlæg",7,{"$f":"Grundkarakterer!H14","v":1},{"$f":"Grundkarakterer!I14","v":0},{"$f":"Grundkarakterer!J14","v":0},{"$f":"Grundkarakterer!K14","v":1},{"$f":"Grundkarakterer!O14","v":0},{"$f":"Grundkarakterer!P14","v":3},{"$f":"Grundkarakterer!Q14","v":1},{"$f":"Grundkarakterer!Q14","v":1},{"$f":"IF(OR($C$4=1,$C$5=1),Grundkarakterer!H14,0)","v":0},{"$f":"IF(C$7=1,Grundkarakterer!I14,0)","v":0},{"$f":"IF(OR(C$5=1,C$6=1),Grundkarakterer!J14,0)","v":0},{"$f":"IF(OR(C$5=1,C$6=1),Grundkarakterer!K14,0)","v":0},0,{"$f":"Grundkarakterer!W14","v":3},{"$f":"Grundkarakterer!AA14","v":0},28,0.8,7,"Ja","Ja",false,"Nej",{"$f":"IF(AND(AB9=\"Ja\",AC9=\"Ja\",Z9=\"Ja\",AA9=\"Ja\"),\"Ja\",\"Nej\")","v":"Nej"},7,{"$f":"INDEX(Grundkarakterer!$B$8:$B$41,AE9)","v":"Hundegræs, udlæg"}]
[null,null,null,null,null,"Frøgræs, udtjent",8,{"$f":"Grundkarakterer!H15","v":1},{"$f":"Grundkarakterer!I15","v":1},{"$f":"Grundkarakterer!J15","v":0},{"$f":"Grundkarakterer!K15","v":0},{"$f":"Grundkarakterer!O15","v":0},{"$f":"Grundkarakterer!P15","v":0},{"$f":"Grundkarakterer!Q15","v":0},{"$f":"Grundkarakterer!Q15","v":0},{"$f":"IF(OR($C$4=1,$C$5=1),Grundkarakterer!H15,0)","v":0},{"$f":"IF(C$7=1,Grundkarakterer!I15,0)","v":0},{"$f":"IF(OR(C$5=1,C$6=1),Grundkarakterer!J15,0)","v":0},{"$f":"IF(OR(C$5=1,C$6=1),Grundkarakterer!K15,0)","v":0},0,{"$f":"Grundkarakterer!W15","v":3},{"$f":"Grundkarakterer!AA15","v":0},27,0.77142857142857146,8,"Ja","Ja",false,"Nej","Nej",8,{"$f":"INDEX(Grundkarakterer!$B$8:$B$41,AE10)","v":"Frøgræs, udtjent"}]
[null,null,null,null,null,"Gul sennep",9,{"$f":"Grundkarakterer!H16","v":1},{"$f":"Grundkarakterer!I16","v":1},{"$f":"Grundkarakterer!J16","v":1},{"$f":"Grundkarakterer!K16","v":0},{"$f":"Grundkarakterer!O16","v":0},{"$f":"Grundkarakterer!P16","v":0},{"$f":"Grundkarakterer!Q16","v":3},{"$f":"Grundkarakterer!Q16","v":3},{"$f":"IF(OR($C$4=1,$C$5=1),Grundkarakterer!H16,0)","v":0},{"$f":"IF(C$7=1,Grundkarakterer!I16,0)","v":0},{"$f":"IF(OR(C$5=1,C$6=1),Grundkarakterer!J16,0)","v":0},{"$f":"IF(OR(C$5=1,C$6=1),Grundkarakterer!K16,0)","v":0},0,{"$f":"Grundkarakterer!W16","v":0},{"$f":"Grundkarakterer!AA16","v":0},26,0.74285714285714288,9,"Ja","Ja",false,"Nej","Nej",9,{"$f":"INDEX(Grundkarakterer!$B$8:$B$41,AE11)","v":"Gul sennep"}]
["Etablering",null,null,null,null,"Olieræddike",10,{"$f":"Grundkarakterer!H17","v":1},{"$f":"Grundkarakterer!I17","v":1},{"$f":"Grundkarakterer!J17","v":1},{"$f":"Grundkarakterer!K17","v":0},{"$f":"Grundkarakterer!O17","v":0},{"$f":"Grundkarakterer!P17","v":0},{"$f":"Grundkarakterer!Q17","v":3},{"$f":"Grundkarakterer!Q17","v":3},{"$f":"IF(OR($C$4=1,$C$5=1),Grundkarakterer!H17,0)","v":0},{"$f":"IF(C$7=1,Grundkarakterer!I17,0)","v":0},{"$f":"IF(OR(C$5=1,C$6=1),Grundkarakterer!J17,0)","v":0},{"$f":"IF(OR(C$5=1,C$6=1),Grundkarakterer!K17,0)","v":0},0,{"$f":"Grundkarakterer!W17","v":2},{"$f":"Grundkarakterer!AA17","v":0},25,0.7142857142857143,10,"Ja","Ja",false,"Nej","Nej",10,{"$f":"INDEX(Grundkarakterer!$B$8:$B$41,AE12)","v":"Olieræddike"}]
[null,"Valg i frontend","Konsekvens",null,null,"Vinterraps, hybrid",11,{"$f":"Grundkarakterer!H18","v":1},{"$f":"Grundkarakterer!I18","v":0},{"$f":"Grundkarakterer!J18","v":1},{"$f":"Grundkarakterer!K18","v":0},{"$f":"Grundkarakterer!O18","v":0},{"$f":"Grundkarakterer!P18","v":0},{"$f":"Grundkarakterer!Q18","v":2},{"$f":"Grundkarakterer!Q18","v":2},{"$f":"IF(OR($C$4=1,$C$5=1),Grundkarakterer!H18,0)","v":0},{"$f":"IF(C$7=1,Grundkarakterer!I18,0)","v":0},{"$f":"IF(OR(C$5=1,C$6=1),Grundkarakterer!J18,0)","v":0},{"$f":"IF(OR(C$5=1,C$6=1),Grundkarakterer!K18,0)","v":0},0,{"$f":"Grundkarakterer!W18","v":0},{"$f":"Grundkarakterer!AA18","v":0},24,0.68571428571428572,11,"Ja","Ja",false,"Nej","Nej",11,{"$f":"INDEX(Grundkarakterer!$B$8:$B$41,AE13)","v":"Vinterraps, hybrid"}]
["Afgrøde type",{"$f":"'Efterafgrøde beslutningsstøtte'!A10","v":"Vælg afgrøde"},{"$f":"IF(B14=\"Vårsæd\",1,IF(B14=\"Vintersæd\",0,\"xx\"))","v":"xx"},"Vårsæd =1",null,"Vinterraps , linie",12,{"$f":"Grundkarakterer!H19","v":1},{"$f":"Grundkarakterer!I19","v":0},{"$f":"Grundkarakterer!J19","v":1},{"$f":"Grundkarakterer!K19","v":0},{"$f":"Grundkarakterer!O19","v":0},{"$f":"Grundkarakterer!P19","v":0},{"$f":"Grundkarakterer!Q19","v":2},{"$f":"Grundkarakterer!Q19","v":2},{"$f":"IF(OR($C$4=1,$C$5=1),Grundkarakterer!H19,0)","v":0},{"$f":"IF(C$7=1,Grundkarakterer!I19,0)","v":0},{"$f":"IF(OR(C$5=1,C$6=1),Grundkarakterer!J19,0)","v":0},{"$f":"IF(OR(C$5=1,C$6=1),Grundkarakterer!K19,0)","v":0},0,{"$f":"Grundkarakterer!W19","v":0},{"$f":"Grundkarakterer!AA19","v":1},23,0.65714285714285714,12,"Ja","Ja",false,"Nej","Nej",12,{"$f":"INDEX(Grundkarakterer!$B$8:$B$41,AE14)","v":"Vinterraps , linie"}]
[null,null,null,null,null,"Foderradise (Strukturator)",13,{"$f":"Grundkarakterer!H20","v":1},{"$f":"Grundkarakterer!I20","v":0},{"$f":"Grundkarakterer!J20","v":1},{"$f":"Grundkarakterer!K20","v":0},{"$f":"Grundkarakterer!O20","v":0},{"$f":"Grundkarakterer!P20","v":0},{"$f":"Grundkarakterer!Q20","v":3},{"$f":"Grundkarakterer!Q20","v":3},{"$f":"IF(OR($C$4=1,$C$5=1),Grundkarakterer!H20,0)","v":0},{"$f":"IF(C$7=1,Grundkarakterer!I20,0)","v":0},{"$f":"IF(OR(C$5=1,C$6=1),Grundkarakterer!J20,0)","v":0},{"$f":"IF(OR(C$5=1,C$6=1),Grundkarakterer!K20,0)","v":0},0,{"$f":"Grundkarakterer!W20","v":2},{"$f":"Grundkarakterer!AA20","v":0},22,0.62857142857142856,13,"Ja","Ja",false,"Nej","Nej",13,{"$f":"INDEX(Grundkarakterer!$B$8:$B$41,AE15)","v":"Foderradise (Strukturator)"}]
["Etableringstidspunkt",null,null,null,null,"Havre, sået inden 1. august",14,{"$f":"Grundkarakterer!H21","v":1},{"$f":"Grundkarakterer!I21","v":0},{"$f":"Grundkarakterer!J21","v":1},{"$f":"Grundkarakterer!K21","v":0},{"$f":"Grundkarakterer!O21","v":0},{"$f":"Grundkarakterer!P21","v":0},{"$f":"Grundkarakterer!Q21","v":1},{"$f":"Grundkarakterer!Q21","v":1},{"$f":"IF(OR($C$4=1,$C$5=1),Grundkarakterer!H21,0)","v":0},{"$f":"IF(C$7=1,Grundkarakterer!I21,0)","v":0},{"$f":"IF(OR(C$5=1,C$6=1),Grundkarakterer!J21,0)","v":0},{"$f":"IF(OR(C$5=1,C$6=1),Grundkarakterer!K21,0)","v":0},0,{"$f":"Grundkarakterer!W21","v":3},{"$f":"Grundkarakterer!AA21","v":1},21,0.6,14,"Ja","Ja",false,"Nej","Nej",14,{"$f":"INDEX(Grundkarakterer!$B$8:$B$41,AE16)","v":"Havre, sået inden 1. august"}]
["Ved såning af primærafgrøde",{"$f":"IF('Efterafgrøde beslutningsstøtte'!A$13=Karaktermatrice!A17,1,0)","v":0},{"$f":"B17","v":0},null,null,"Havre, sået mellem 1. og 20. august",15,{"$f":"Grundkarakterer!H22","v":0},{"$f":"Grundkarakterer!I22","v":0},{"$f":"Grundkarakterer!J22","v":0},{"$f":"Grundkarakterer!K22","v":0},{"$f":"Grundkarakterer!O22","v":0},{"$f":"Grundkarakterer!P22","v":0},{"$f":"Grundkarakterer!Q22","v":0},{"$f":"Grundkarakterer!Q22","v":0},{"$f":"IF(OR($C$4=1,$C$5=1),Grundkarakterer!H22,0)","v":0},{"$f":"IF(C$7=1,Grundkarakterer!I22,0)","v":0},{"$f":"IF(OR(C$5=1,C$6=1),Grundkarakterer!J22,0)","v":0},{"$f":"IF(OR(C$5=1,C$6=1),Grundkarakterer!K22,0)","v":0},0,{"$f":"Grundkarakterer!W22","v":3},{"$f":"Grundkarakterer!AA22","v":1},20,0.5714285714285714,15,"Ja","Ja",false,"Nej","Nej",15,{"$f":"INDEX(Grundkarakterer!$B$8:$B$41,AE17)","v":"Havre, sået mellem 1. og 20. august"}]
["2-3 uger før høst af primærafgrøde",{"$f":"IF('Efterafgrøde beslutningsstøtte'!A$13=Karaktermatrice!A18,1,0)","v":0},{"$f":"B18","v":0},null,null,"Stauderug, sået inden 1. august",16,{"$f":"Grundkarakterer!H23","v":1},{"$f":"Grundkarakterer!I23","v":0},{"$f":"Grundkarakterer!J23","v":1},{"$f":"Grundkarakterer!K23","v":0},{"$f":"Grundkarakterer!O23","v":0},{"$f":"Grundkarakterer!P23","v":0},{"$f":"Grundkarakterer!Q23","v":1},{"$f":"Grundkarakterer!Q23","v":1},{"$f":"IF(OR($C$4=1,$C$5=1),Grundkarakterer!H23,0)","v":0},{"$f":"IF(C$7=1,Grundkarakterer!I23,0)","v":0},{"$f":"IF(OR(C$5=1,C$6=1),Grundkarakterer!J23,0)","v":0},{"$f":"IF(OR(C$5=1,C$6=1),Grundkarakterer!K23,0)","v":0},0,{"$f":"Grundkarakterer!W23","v":3},{"$f":"Grundkarakterer!AA23","v":0},19,0.54285714285714282,16,"Ja","Ja",false,"Nej","Nej",16,{"$f":"INDEX(Grundkarakterer!$B$8:$B$41,AE18)","v":"Stauderug, sået inden 1. august"}]
["Efter høst af primærafgrøde",{"$f":"IF('Efterafgrøde beslutningsstøtte'!A$13=Karaktermatrice!A19,1,0)","v":0},{"$f":"B19","v":0},null,null,"Stauderug, sået mellem 1. og 20. august",17,{"$f":"Grundkarakterer!H24","v":1},{"$f":"Grundkarakterer!I24","v":0},{"$f":"Grundkarakterer!J24","v":1},{"$f":"Grundkarakterer!K24","v":0},{"$f":"Grundkarakterer!O24","v":0},{"$f":"Grundkarakterer!P24","v":0},{"$f":"Grundkarakterer!Q24","v":0},{"$f":"Grundkarakterer!Q24","v":0},{"$f":"IF(OR($C$4=1,$C$5=1),Grundkarakterer!H24,0)","v":0},{"$f":"IF(C$7=1,Grundkarakterer!I24,0)","v":0},{"$f":"IF(OR(C$5=1,C$6=1),Grundkarakterer!J24,0)","v":0},{"$f":"IF(OR(C$5=1,C$6=1),Grundkarakterer!K24,0)","v":0},0,{"$f":"Grundkarakterer!W24","v":3},{"$f":"Grundkarakterer!AA24","v":0},18,0.51428571428571423,17,"Ja","Ja",false,"Nej","Nej",17,{"$f":"INDEX(Grundkarakterer!$B$8:$B$41,AE19)","v":"Stauderug, sået mellem 1. og 20. august"}]
[null,null,null,null,null,"Vårbyg, sået inden 1. august",18,{"$f":"Grundkarakterer!H25","v":1},{"$f":"Grundkarakterer!I25","v":0},{"$f":"Grundkarakterer!J25","v":1},{"$f":"Grundkarakterer!K25","v":0},{"$f":"Grundkarakterer!O25","v":0},{"$f":"Grundkarakterer!P25","v":0},{"$f":"Grundkarakterer!Q25","v":1},{"$f":"Grundkarakterer!Q25","v":1},{"$f":"IF(OR($C$4=1,$C$5=1),Grundkarakterer!H25,0)","v":0},{"$f":"IF(C$7=1,Grundkarakterer!I25,0)","v":0},{"$f":"IF(OR(C$5=1,C$6=1),Grundkarakterer!J25,0)","v":0},{"$f":"IF(OR(C$5=1,C$6=1),Grundkarakterer!K25,0)","v":0},0,{"$f":"Grundkarakterer!W25","v":3},{"$f":"Grundkarakterer!AA25","v":1},17,0.48571428571428571,18,"Ja","Ja",false,"Nej","Nej",18,{"$f":"INDEX(Grundkarakterer!$B$8:$B$41,AE20)","v":"Vårbyg, sået inden 1. august"}]
["Egnet til udlæg efterår i vinterkorn",null,{"$f":"IF(C14=\"xx\",\"xx\",IF(AND(C14=0,C17=1),1,0))","v":"xx"},null,null,"Vårbyg, sået mellem 1. og 20. august",19,{"$f":"Grundkarakterer!H26","v":1},{"$f":"Grundkarakterer!I26","v":0},{"$f":"Grundkarakterer!J26","v":1},{"$f":"Grundkarakterer!K26","v":0},{"$f":"Grundkarakterer!O26","v":0},{"$f":"Grundkarakterer!P26","v":0},{"$f":"Grundkarakterer!Q26","v":0},{"$f":"Grundkarakterer!Q26","v":0},{"$f":"IF(OR($C$4=1,$C$5=1),Grundkarakterer!H26,0)","v":0},{"$f":"IF(C$7=1,Grundkarakterer!I26,0)","v":0},{"$f":"IF(OR(C$5=1,C$6=1),Grundkarakterer!J26,0)","v":0},{"$f":"IF(OR(C$5=1,C$6=1),Grundkarakterer!K26,0)","v":0},0,{"$f":"Grundkarakterer!W26","v":3},{"$f":"Grundkarakterer!AA26","v":1},16,0.45714285714285713,19,"Ja","Ja",false,"Nej","Nej",19,{"$f":"INDEX(Grundkarakterer!$B$8:$B$41,AE21)","v":"Vårbyg, sået mellem 1. og 20. august"}]
["Egnet til udlæg forår",null,{"$f":"IF(C14=\"xx\",\"xx\",IF(AND(C14=1,C17=1),1,IF(OR(C18=1,C19=1),0,0)))","v":"xx"},null,null,"Vinterrug (population), sået inden 1. august",20,{"$f":"Grundkarakterer!H27","v":1},{"$f":"Grundkarakterer!I27","v":0},{"$f":"Grundkarakterer!J27","v":1},{"$f":"Grundkarakterer!K27","v":0},{"$f":"Grundkarakterer!O27","v":0},{"$f":"Grundkarakterer!P27","v":0},{"$f":"Grundkarakterer!Q27","v":1},{"$f":"Grundkarakterer!Q27","v":1},{"$f":"IF(OR($C$4=1,$C$5=1),Grundkarakterer!H27,0)","v":0},{"$f":"IF(C$7=1,Grundkarakterer!I27,0)","v":0},{"$f":"IF(OR(C$5=1,C$6=1),Grundkarakterer!J27,0)","v":0},{"$f":"IF(OR(C$5=1,C$6=1),Grundkarakterer!K27,0)","v":0},0,{"$f":"Grundkarakterer!W27","v":3},{"$f":"Grundkarakterer!AA27","v":1},15,0.42857142857142855,20,"Ja","Ja",false,"Nej","Nej",20,{"$f":"INDEX(Grundkarakterer!$B$8:$B$41,AE22)","v":"Vinterrug (population), sået inden 1. august"}]
["Egnet til udsåning 2-3 uger før høst",null,{"$f":"IF(C14=\"xx\",\"xx\",IF(C18=1,1,0))","v":"xx"},null,null,"Vinterrug (population), sået inden 20. august",21,{"$f":"Grundkarakterer!H28","v":1},{"$f":"Grundkarakterer!I28","v":0},{"$f":"Grundkarakterer!J28","v":1},{"$f":"Grundkarakterer!K28","v":0},{"$f":"Grundkarakterer!O28","v":0},{"$f":"Grundkarakterer!P28","v":0},{"$f":"Grundkarakterer!Q28","v":0},{"$f":"Grundkarakterer!Q28","v":0},{"$f":"IF(OR($C$4=1,$C$5=1),Grundkarakterer!H28,0)","v":0},{"$f":"IF(C$7=1,Grundkarakterer!I28,0)","v":0},{"$f":"IF(OR(C$5=1,C$6=1),Grundkarakterer!J28,0)","v":0},{"$f":"IF(OR(C$5=1,C$6=1),Grundkarakterer!K28,0)","v":0},0,{"$f":"Grundkarakterer!W28","v":3},{"$f":"Grundkarakterer!AA28","v":1},14,0.4,21,"Ja","Ja",false,"Nej","Nej",21,{"$f":"INDEX(Grundkarakterer!$B$8:$B$41,AE23)","v":"Vinterrug (population), sået inden 20. august"}]
["Egnet til udsåning efter tidlig høst (10. august)",null,{"$f":"IF(C14=\"xx\",\"xx\",IF(C19=1,1,0))","v":"xx"},null,null,"Vinterrug (hybrid og syntetisk), sået inden 1. august",22,{"$f":"Grundkarakterer!H29","v":1},{"$f":"Grundkarakterer!I29","v":0},{"$f":"Grundkarakterer!J29","v":1},{"$f":"Grundkarakterer!K29","v":0},{"$f":"Grundkarakterer!O29","v":0},{"$f":"Grundkarakterer!P29","v":0},{"$f":"Grundkarakterer!Q29","v":1},{"$f":"Grundkarakterer!Q29","v":1},{"$f":"IF(OR($C$4=1,$C$5=1),Grundkarakterer!H29,0)","v":0},{"$f":"IF(C$7=1,Grundkarakterer!I29,0)","v":0},{"$f":"IF(OR(C$5=1,C$6=1),Grundkarakterer!J29,0)","v":0},{"$f":"IF(OR(C$5=1,C$6=1),Grundkarakterer!K29,0)","v":0},0,{"$f":"Grundkarakterer!W29","v":3},{"$f":"Grundkarakterer!AA29","v":0},13,0.37142857142857144,22,"Ja","Ja",false,"Nej","Nej",22,{"$f":"INDEX(Grundkarakterer!$B$8:$B$41,AE24)","v":"Vinterrug (hybrid og syntetisk), sået inden 1. august"}]
[null,null,null,null,null,"Vinterrug (hybrid og syntetisk), sået inden 20. august",23,{"$f":"Grundkarakterer!H30","v":1},{"$f":"Grundkarakterer!I30","v":0},{"$f":"Grundkarakterer!J30","v":1},{"$f":"Grundkarakterer!K30","v":0},{"$f":"Grundkarakterer!O30","v":0},{"$f":"Grundkarakterer!P30","v":0},{"$f":"Grundkarakterer!Q30","v":0},{"$f":"Grundkarakterer!Q30","v":0},{"$f":"IF(OR($C$4=1,$C$5=1),Grundkarakterer!H30,0)","v":0},{"$f":"IF(C$7=1,Grundkarakterer!I30,0)","v":0},{"$f":"IF(OR(C$5=1,C$6=1),Grundkarakterer!J30,0)","v":0},{"$f":"IF(OR(C$5=1,C$6=1),Grundkarakterer!K30,0)","v":0},0,{"$f":"Grundkarakterer!W30","v":3},{"$f":"Grundkarakterer!AA30","v":0},12,0.34285714285714286,23,"Ja","Ja",false,"Nej","Nej",23,{"$f":"INDEX(Grundkarakterer!$B$8:$B$41,AE25)","v":"Vinterrug (hybrid og syntetisk), sået inden 20. august"}]
["Kålbrok",{"$f":"'Efterafgrøde beslutningsstøtte'!B28","v":"Ikke vigtigt"},{"$f":"IF(OR(B26=\"Ikke vigtigt\",B26=\"Foretrækkes\"),0,IF(B26=\"Der må ikke opformeres kålbrok\",1,\"Fejl\"))","v":0},"1= må ikke forekomme",null,"Cikorie",24,{"$f":"Grundkarakterer!H31","v":1},{"$f":"Grundkarakterer!I31","v":0},{"$f":"Grundkarakterer!J31","v":1},{"$f":"Grundkarakterer!K31","v":0},{"$f":"Grundkarakterer!O31","v":0},{"$f":"Grundkarakterer!P31","v":3},{"$f":"Grundkarakterer!Q31","v":0},{"$f":"Grundkarakterer!Q31","v":0},{"$f":"IF(OR($C$4=1,$C$5=1),Grundkarakterer!H31,0)","v":0},{"$f":"IF(C$7=1,Grundkarakterer!I31,0)","v":0},{"$f":"IF(OR(C$5=1,C$6=1),Grundkarakterer!J31,0)","v":0},{"$f":"IF(OR(C$5=1,C$6=1),Grundkarakterer!K31,0)","v":0},0,{"$f":"Grundkarakterer!W31","v":3},{"$f":"Grundkarakterer!AA31","v":0},11,0.31428571428571428,24,"Ja","Ja",false,"Nej","Nej",24,{"$f":"INDEX(Grundkarakterer!$B$8:$B$41,AE26)","v":"Cikorie"}]
["Egen udsæd",{"$f":"'Efterafgrøde beslutningsstøtte'!B33","v":"Ikke vigtigt"},{"$f":"IF(B27=\"Egen udsæd skal anvendes \",1,0)","v":0},"1 = Egen udsæd skal kunne anvendes",null,"Honningurt",25,{"$f":"Grundkarakterer!H32","v":1},{"$f":"Grundkarakterer!I32","v":0},{"$f":"Grundkarakterer!J32","v":1},{"$f":"Grundkarakterer!K32","v":0},{"$f":"Grundkarakterer!O32","v":0},{"$f":"Grundkarakterer!P32","v":0},{"$f":"Grundkarakterer!Q32","v":2},{"$f":"Grundkarakterer!Q32","v":2},{"$f":"IF(OR($C$4=1,$C$5=1),Grundkarakterer!H32,0)","v":0},{"$f":"IF(C$7=1,Grundkarakterer!I32,0)","v":0},{"$f":"IF(OR(C$5=1,C$6=1),Grundkarakterer!J32,0)","v":0},{"$f":"IF(OR(C$5=1,C$6=1),Grundkarakterer!K32,0)","v":0},0,{"$f":"Grundkarakterer!W32","v":3},{"$f":"Grundkarakterer!AA32","v":1},10,0.2857142857142857,25,"Ja","Ja",false,"Nej","Nej",25,{"$f":"INDEX(Grundkarakterer!$B$8:$B$41,AE27)","v":"Honningurt"}]
[null,null,null,null,null,"Fodervikke ",26,{"$f":"Grundkarakterer!H33","v":0},{"$f":"Grundkarakterer!I33","v":0},{"$f":"Grundkarakterer!J33","v":0},{"$f":"Grundkarakterer!K33","v":0},{"$f":"Grundkarakterer!O33","v":0},{"$f":"Grundkarakterer!P33","v":0},{"$f":"Grundkarakterer!Q33","v":3},{"$f":"Grundkarakterer!Q33","v":3},{"$f":"IF(OR($C$4=1,$C$5=1),Grundkarakterer!H33,0)","v":0},{"$f":"IF(C$7=1,Grundkarakterer!I33,0)","v":0},{"$f":"IF(OR(C$5=1,C$6=1),Grundkarakterer!J33,0)","v":0},{"$f":"IF(OR(C$5=1,C$6=1),Grundkarakterer!K33,0)","v":0},0,{"$f":"Grundkarakterer!W33","v":3},{"$f":"Grundkarakterer!AA33","v":1},9,0.25714285714285712,26,"Ja","Ja",false,"Nej","Nej",26,{"$f":"INDEX(Grundkarakterer!$B$8:$B$41,AE28)","v":"Fodervikke "}]
["Obligatoriske valg foretaget?",null,null,null,null,"Vintervikke",27,{"$f":"Grundkarakterer!H34","v":0},{"$f":"Grundkarakterer!I34","v":0},{"$f":"Grundkarakterer!J34","v":0},{"$f":"Grundkarakterer!K34","v":1},{"$f":"Grundkarakterer!O34","v":0},{"$f":"Grundkarakterer!P34","v":0},{"$f":"Grundkarakterer!Q34","v":0},{"$f":"Grundkarakterer!Q34","v":0},{"$f":"IF(OR($C$4=1,$C$5=1),Grundkarakterer!H34,0)","v":0},{"$f":"IF(C$7=1,Grundkarakterer!I34,0)","v":0},{"$f":"IF(OR(C$5=1,C$6=1),Grundkarakterer!J34,0)","v":0},{"$f":"IF(OR(C$5=1,C$6=1),Grundkarakterer!K34,0)","v":0},0,{"$f":"Grundkarakterer!W34","v":3},{"$f":"Grundkarakterer!AA34","v":0},8,0.22857142857142856,27,"Ja","Ja",false,"Nej","Nej",27,{"$f":"INDEX(Grundkarakterer!$B$8:$B$41,AE29)","v":"Vintervikke"}]
[{"$f":"IF(AND('Efterafgrøde beslutningsstøtte'!A7<>\"Vælg funktion\",'Efterafgrøde beslutningsstøtte'!A10<>\"Vælg afgrøde\",'Efterafgrøde beslutningsstøtte'!A13<>\"Vælg etableringstidspunkt\",'Efterafgrøde beslutningsstøtte'!A16<>\"Vælg jordtype\",'Efterafgrøde beslutningsstøtte'!A19<>\"Vælg afgrøde\"),\"Ja\",\"Nej\")","v":"Nej"},null,null,null,null,"Alexandrinekløver",28,{"$f":"Grundkarakterer!H35","v":0},{"$f":"Grundkarakterer!I35","v":0},{"$f":"Grundkarakterer!J35","v":0},{"$f":"Grundkarakterer!K35","v":0},{"$f":"Grundkarakterer!O35","v":0},{"$f":"Grundkarakterer!P35","v":2},{"$f":"Grundkarakterer!Q35","v":3},{"$f":"Grundkarakterer!Q35","v":3},{"$f":"IF(OR($C$4=1,$C$5=1),Grundkarakterer!H35,0)","v":0},{"$f":"IF(C$7=1,Grundkarakterer!I35,0)","v":0},{"$f":"IF(OR(C$5=1,C$6=1),Grundkarakterer!J35,0)","v":0},{"$f":"IF(OR(C$5=1,C$6=1),Grundkarakterer!K35,0)","v":0},0,{"$f":"Grundkarakterer!W35","v":3},{"$f":"Grundkarakterer!AA35","v":1},7,0.2,28,"Ja","Ja",false,"Nej","Nej",28,{"$f":"INDEX(Grundkarakterer!$B$8:$B$41,AE30)","v":"Alexandrinekløver"}]
[null,null,null,null,null,"Hvidkløver",29,{"$f":"Grundkarakterer!H36","v":0},{"$f":"Grundkarakterer!I36","v":0},{"$f":"Grundkarakterer!J36","v":0},{"$f":"Grundkarakterer!K36","v":0},{"$f":"Grundkarakterer!O36","v":0},{"$f":"Grundkarakterer!P36","v":3},{"$f":"Grundkarakterer!Q36","v":1},{"$f":"Grundkarakterer!Q36","v":1},{"$f":"IF(OR($C$4=1,$C$5=1),Grundkarakterer!H36,0)","v":0},{"$f":"IF(C$7=1,Grundkarakterer!I36,0)","v":0},{"$f":"IF(OR(C$5=1,C$6=1),Grundkarakterer!J36,0)","v":0},{"$f":"IF(OR(C$5=1,C$6=1),Grundkarakterer!K36,0)","v":0},0,{"$f":"Grundkarakterer!W36","v":3},{"$f":"Grundkarakterer!AA36","v":0},6,0.17142857142857143,29,"Ja","Ja",false,"Nej","Nej",29,{"$f":"INDEX(Grundkarakterer!$B$8:$B$41,AE31)","v":"Hvidkløver"}]
[null,null,null,null,null,"Blanding af olieræddike og fodervikke",30,{"$f":"Grundkarakterer!H37","v":0},{"$f":"Grundkarakterer!I37","v":0},{"$f":"Grundkarakterer!J37","v":0},{"$f":"Grundkarakterer!K37","v":0},{"$f":"Grundkarakterer!O37","v":0},{"$f":"Grundkarakterer!P37","v":0},{"$f":"Grundkarakterer!Q37","v":3},{"$f":"Grundkarakterer!Q37","v":3},{"$f":"IF(OR($C$4=1,$C$5=1),Grundkarakterer!H37,0)","v":0},{"$f":"IF(C$7=1,Grundkarakterer!I37,0)","v":0},{"$f":"IF(OR(C$5=1,C$6=1),Grundkarakterer!J37,0)","v":0},{"$f":"IF(OR(C$5=1,C$6=1),Grundkarakterer!K37,0)","v":0},0,{"$f":"Grundkarakterer!W37","v":2},{"$f":"Grundkarakterer!AA37","v":0},5,0.14285714285714285,30,"Ja","Ja",false,"Nej","Nej",30,{"$f":"INDEX(Grundkarakterer!$B$8:$B$41,AE32)","v":"Blanding af olieræddike og fodervikke"}]
[null,null,null,null,null,"Hvidkløver/alm. rajgræs",31,{"$f":"Grundkarakterer!H38","v":0},{"$f":"Grundkarakterer!I38","v":0},{"$f":"Grundkarakterer!J38","v":0},{"$f":"Grundkarakterer!K38","v":1},{"$f":"Grundkarakterer!O38","v":0},{"$f":"Grundkarakterer!P38","v":3},{"$f":"Grundkarakterer!Q38","v":1},{"$f":"Grundkarakterer!Q38","v":1},{"$f":"IF(OR($C$4=1,$C$5=1),Grundkarakterer!H38,0)","v":0},{"$f":"IF(C$7=1,Grundkarakterer!I38,0)","v":0},{"$f":"IF(OR(C$5=1,C$6=1),Grundkarakterer!J38,0)","v":0},{"$f":"IF(OR(C$5=1,C$6=1),Grundkarakterer!K38,0)","v":0},0,{"$f":"Grundkarakterer!W38","v":3},{"$f":"Grundkarakterer!AA38","v":0},4,0.11428571428571428,31,"Ja","Ja",false,"Nej","Nej",31,{"$f":"INDEX(Grundkarakterer!$B$8:$B$41,AE33)","v":"Hvidkløver/alm. rajgræs"}]
[null,null,null,null,null,"Rødkløver/strandsvingel",32,{"$f":"Grundkarakterer!H39","v":0},{"$f":"Grundkarakterer!I39","v":0},{"$f":"Grundkarakterer!J39","v":0},{"$f":"Grundkarakterer!K39","v":1},{"$f":"Grundkarakterer!O39","v":0},{"$f":"Grundkarakterer!P39","v":1},{"$f":"Grundkarakterer!Q39","v":0},{"$f":"Grundkarakterer!Q39","v":0},{"$f":"IF(OR($C$4=1,$C$5=1),Grundkarakterer!H39,0)","v":0},{"$f":"IF(C$7=1,Grundkarakterer!I39,0)","v":0},{"$f":"IF(OR(C$5=1,C$6=1),Grundkarakterer!J39,0)","v":0},{"$f":"IF(OR(C$5=1,C$6=1),Grundkarakterer!K39,0)","v":0},0,{"$f":"Grundkarakterer!W39","v":3},{"$f":"Grundkarakterer!AA39","v":0},3,8.5714285714285715E-2,32,"Ja","Ja",false,"Nej","Nej",32,{"$f":"INDEX(Grundkarakterer!$B$8:$B$41,AE34)","v":"Rødkløver/strandsvingel"}]
[null,null,null,null,null,"Vintervikke/vinterrug",33,{"$f":"Grundkarakterer!H40","v":0},{"$f":"Grundkarakterer!I40","v":0},{"$f":"Grundkarakterer!J40","v":0},{"$f":"Grundkarakterer!K40","v":0},{"$f":"Grundkarakterer!O40","v":0},{"$f":"Grundkarakterer!P40","v":0},{"$f":"Grundkarakterer!Q40","v":0},{"$f":"Grundkarakterer!Q40","v":0},{"$f":"IF(OR($C$4=1,$C$5=1),Grundkarakterer!H40,0)","v":0},{"$f":"IF(C$7=1,Grundkarakterer!I40,0)","v":0},{"$f":"IF(OR(C$5=1,C$6=1),Grundkarakterer!J40,0)","v":0},{"$f":"IF(OR(C$5=1,C$6=1),Grundkarakterer!K40,0)","v":0},0,{"$f":"Grundkarakterer!W40","v":3},{"$f":"Grundkarakterer!AA40","v":0},2,5.7142857142857141E-2,33,"Ja","Ja",false,"Nej","Nej",33,{"$f":"INDEX(Grundkarakterer!$B$8:$B$41,AE35)","v":"Vintervikke/vinterrug"}]
[null,null,null,null,null,"Kløvergræs",34,{"$f":"Grundkarakterer!H41","v":0},{"$f":"Grundkarakterer!I41","v":0},{"$f":"Grundkarakterer!J41","v":0},{"$f":"Grundkarakterer!K41","v":1},{"$f":"Grundkarakterer!O41","v":0},{"$f":"Grundkarakterer!P41","v":3},{"$f":"Grundkarakterer!Q41","v":1},{"$f":"Grundkarakterer!Q41","v":1},{"$f":"IF(OR($C$4=1,$C$5=1),Grundkarakterer!H41,0)","v":0},{"$f":"IF(C$7=1,Grundkarakterer!I41,0)","v":0},{"$f":"IF(OR(C$5=1,C$6=1),Grundkarakterer!J41,0)","v":0},{"$f":"IF(OR(C$5=1,C$6=1),Grundkarakterer!K41,0)","v":0},0,{"$f":"Grundkarakterer!W41","v":3},{"$f":"Grundkarakterer!AA41","v":0},1,2.8571428571428571E-2,34,"Ja","Ja",false,"Nej","Nej",34,{"$f":"INDEX(Grundkarakterer!$B$8:$B$41,AE36)","v":"Kløvergræs"}]
[null,null,null,null,null,null,null,null,null,null,null,null,null,null,null,null,null,null,null,null,null,null,null,null,null,null,null,null,null,{"$f":"COUNTIF(AD3:AD36,\"Ja\")","v":0}]
[null,null,null,null,null,null,null,1,2,null,3,4,5,6,7,8,9,10,11,12,13,14,15,16,17,18,19,20,21,22,33]
[null,"Index","Med","Efterafgrøde","Afgrøde","Tidspunkt","Link","Pris","Pligtig efterafgrøde","Pligtig mellemafgrøde","MFO-efterafgrøde i blanding2)","MFO-udlæg3)","Miljø-efterafgrøder","Frivillig efterafgrøde","Grønne marker (2,3 DE-brug)","Egnet til udlæg efterår i vinterkorn","Egnet til udlæg forår","Egnet til udsåning 2-3 uger før høst","Egnet til udsåning efter tidlig høst (10. august)","Kvælstoffikserende","Stor kvælstof-eftervirkning","Hurtig og dyb rodvækst på lerjord","Er afgrøden robust mod ukrudtsmidler?","Der findes sorter, der ikke opformerer kålbrok","Der findes sorter, der er sanerende for roecystenematoder","Kan anvendes i sædskifter med kartofler (opformerer ikke fritlevende nematoder og rodfiltsvamp","Vinterfast","Egen udsæd kan anvendes4)","Tiebreak","Kommentare ang. ukrudt","Nettoomkostninger"]
[1,{"$f":"INDEX(Grundkarakterer!A$8:A$41,AE3)","v":1},{"$f":"IF(AND(VLOOKUP(B40,$G$3:$AE$36,24,FALSE)=\"Ja\",A$30=\"Ja\"),\"Ja\",\"Nej\")","v":"Nej"},{"$f":"IF(C40=\"Ja\",INDEX(Grundkarakterer!B$8:B$41,AE3),\"xx\")","v":"xx"},{"$f":"IF(C40=\"Ja\",INDEX(Grundkarakterer!C$8:C$41,$AE3),\"xx\")","v":"xx"},{"$f":"IF(C40=\"Ja\",INDEX(Grundkarakterer!D$8:D$41,$AE3),\"xx\")","v":"xx"},{"$f":"IF(C40=\"Ja\",INDEX(Grundkarakterer!E$8:E$41,$AE3),\"xx\")","v":"xx"},{"$f":"IF($C40=\"Ja\",INDEX(Grundkarakterer!F$8:F$41,$AE3),\"xx\")","v":"xx"},{"$f":"IF($C40=\"Ja\",INDEX(Grundkarakterer!H$8:H$41,$AE3),\"xx\")","v":"xx"},{"$f":"IF($C40=\"Ja\",INDEX(Grundkarakterer!I$8:I$41,$AE3),\"xx\")","v":"xx"},{"$f":"IF($C40=\"Ja\",INDEX(Grundkarakterer!J$8:J$41,$AE3),\"xx\")","v":"xx"},{"$f":"IF($C40=\"Ja\",INDEX(Grundkarakterer!K$8:K$41,$AE3),\"xx\")","v":"xx"},{"$f":"IF($C40=\"Ja\",INDEX(Grundkarakterer!L$8:L$41,$AE3),\"xx\")","v":"xx"},{"$f":"IF($C40=\"Ja\",INDEX(Grundkarakterer!M$8:M$41,$AE3),\"xx\")","v":"xx"},{"$f":"IF($C40=\"Ja\",INDEX(Grundkarakterer!N$8:N$41,$AE3),\"xx\")","v":"xx"},{"$f":"IF($C40=\"Ja\",INDEX(Grundkarakterer!O$8:O$41,$AE3),\"xx\")","v":"xx"},{"$f":"IF($C40=\"Ja\",INDEX(Grundkarakterer!P$8:P$41,$AE3),\"xx\")","v":"xx"},{"$f":"IF($C40=\"Ja\",INDEX(Grundkarakterer!Q$8:Q$41,$AE3),\"xx\")","v":"xx"},{"$f":"IF($C40=\"Ja\",INDEX(Grundkarakterer!R$8:R$41,$AE3),\"xx\")","v":"xx"},{"$f":"IF($C40=\"Ja\",INDEX(Grundkarakterer!S$8:S$41,$AE3),\"xx\")","v":"xx"},{"$f":"IF($C40=\"Ja\",INDEX(Grundkarakterer!T$8:T$41,$AE3),\"xx\")","v":"xx"},{"$f":"IF($C40=\"Ja\",INDEX(Grundkarakterer!U$8:U$41,$AE3),\"xx\")","v":"xx"},{"$f":"IF($C40=\"Ja\",INDEX(Grundkarakterer!V$8:V$41,$AE3),\"xx\")","v":"xx"},{"$f":"IF($C40=\"Ja\",INDEX(Grundkarakterer!W$8:W$41,$AE3),\"xx\")","v":"xx"},{"$f":"IF($C40=\"Ja\",INDEX(Grundkarakterer!X$8:X$41,$AE3),\"xx\")","v":"xx"},{"$f":"IF($C40=\"Ja\",INDEX(Grundkarakterer!Y$8:Y$41,$AE3),\"xx\")","v":"xx"},{"$f":"IF($C40=\"Ja\",INDEX(Grundkarakterer!Z$8:Z$41,$AE3),\"xx\")","v":"xx"},{"$f":"IF($C40=\"Ja\",INDEX(Grundkarakterer!AA$8:AA$41,$AE3),\"xx\")","v":"xx"},{"$f":"IF($C40=\"Ja\",INDEX(Grundkarakterer!AB$8:AB$41,$AE3),\"xx\")","v":"xx"},{"$f":"IF($C40=\"Ja\",INDEX(Grundkarakterer!AC$8:AC$41,$AE3),\"xx\")","v":"xx"},{"$f":"IF($C40=\"Ja\",INDEX(Grundkarakterer!G$8:G$41,$AE3),\"xx\")","v":"xx"}]
[2,{"$f":"INDEX(Grundkarakterer!A$8:A$41,AE4)","v":2},{"$f":"IF(AND(VLOOKUP(B41,$G$3:$AE$36,24,FALSE)=\"Ja\",A$30=\"Ja\"),\"Ja\",\"Nej\")","v":"Nej"},{"$f":"IF(C41=\"Ja\",INDEX(Grundkarakterer!B$8:B$41,AE4),\"xx\")","v":"xx"},{"$f":"IF(C41=\"Ja\",INDEX(Grundkarakterer!C$8:C$41,$AE4),\"xx\")","v":"xx"},{"$f":"IF(C41=\"Ja\",INDEX(Grundkarakterer!D$8:D$41,$AE4),\"xx\")","v":"xx"},{"$f":"IF(C41=\"Ja\",INDEX(Grundkarakterer!E$8:E$41,$AE4),\"xx\")","v":"xx"},{"$f":"IF($C41=\"Ja\",INDEX(Grundkarakterer!F$8:F$41,$AE4),\"xx\")","v":"xx"},{"$f":"IF($C41=\"Ja\",INDEX(Grundkarakterer!H$8:H$41,$AE4),\"xx\")","v":"xx"},{"$f":"IF($C41=\"Ja\",INDEX(Grundkarakterer!I$8:I$41,$AE4),\"xx\")","v":"xx"},{"$f":"IF($C41=\"Ja\",INDEX(Grundkarakterer!J$8:J$41,$AE4),\"xx\")","v":"xx"},{"$f":"IF($C41=\"Ja\",INDEX(Grundkarakterer!K$8:K$41,$AE4),\"xx\")","v":"xx"},{"$f":"IF($C41=\"Ja\",INDEX(Grundkarakterer!L$8:L$41,$AE4),\"xx\")","v":"xx"},{"$f":"IF($C41=\"Ja\",INDEX(Grundkarakterer!M$8:M$41,$AE4),\"xx\")","v":"xx"},{"$f":"IF($C41=\"Ja\",INDEX(Grundkarakterer!N$8:N$41,$AE4),\"xx\")","v":"xx"},{"$f":"IF($C41=\"Ja\",INDEX(Grundkarakterer!O$8:O$41,$AE4),\"xx\")","v":"xx"},{"$f":"IF($C41=\"Ja\",INDEX(Grundkarakterer!P$8:P$41,$AE4),\"xx\")","v":"xx"},{"$f":"IF($C41=\"Ja\",INDEX(Grundkarakterer!Q$8:Q$41,$AE4),\"xx\")","v":"xx"},{"$f":"IF($C41=\"Ja\",INDEX(Grundkarakterer!R$8:R$41,$AE4),\"xx\")","v":"xx"},{"$f":"IF($C41=\"Ja\",INDEX(Grundkarakterer!S$8:S$41,$AE4),\"xx\")","v":"xx"},{"$f":"IF($C41=\"Ja\",INDEX(Grundkarakterer!T$8:T$41,$AE4),\"xx\")","v":"xx"},{"$f":"IF($C41=\"Ja\",INDEX(Grundkarakterer!U$8:U$41,$AE4),\"xx\")","v":"xx"},{"$f":"IF($C41=\"Ja\",INDEX(Grundkarakterer!V$8:V$41,$AE4),\"xx\")","v":"xx"},{"$f":"IF($C41=\"Ja\",INDEX(Grundkarakterer!W$8:W$41,$AE4),\"xx\")","v":"xx"},{"$f":"IF($C41=\"Ja\",INDEX(Grundkarakterer!X$8:X$41,$AE4),\"xx\")","v":"xx"},{"$f":"IF($C41=\"Ja\",INDEX(Grundkarakterer!Y$8:Y$41,$AE4),\"xx\")","v":"xx"},{"$f":"IF($C41=\"Ja\",INDEX(Grundkarakterer!Z$8:Z$41,$AE4),\"xx\")","v":"xx"},{"$f":"IF($C41=\"Ja\",INDEX(Grundkarakterer!AA$8:AA$41,$AE4),\"xx\")","v":"xx"},{"$f":"IF($C41=\"Ja\",INDEX(Grundkarakterer!AB$8:AB$41,$AE4),\"xx\")","v":"xx"},{"$f":"IF($C41=\"Ja\",INDEX(Grundkarakterer!AC$8:AC$41,$AE4),\"xx\")","v":"xx"},{"$f":"IF($C41=\"Ja\",INDEX(Grundkarakterer!G$8:G$41,$AE4),\"xx\")","v":"xx"}]
[3,{"$f":"INDEX(Grundkarakterer!A$8:A$41,AE5)","v":3},"Nej",{"$f":"IF(C42=\"Ja\",INDEX(Grundkarakterer!B$8:B$41,AE5),\"xx\")","v":"xx"},{"$f":"IF(C42=\"Ja\",INDEX(Grundkarakterer!C$8:C$41,$AE5),\"xx\")","v":"xx"},{"$f":"IF(C42=\"Ja\",INDEX(Grundkarakterer!D$8:D$41,$AE5),\"xx\")","v":"xx"},{"$f":"IF(C42=\"Ja\",INDEX(Grundkarakterer!E$8:E$41,$AE5),\"xx\")","v":"xx"},{"$f":"IF($C42=\"Ja\",INDEX(Grundkarakterer!F$8:F$41,$AE5),\"xx\")","v":"xx"},{"$f":"IF($C42=\"Ja\",INDEX(Grundkarakterer!H$8:H$41,$AE5),\"xx\")","v":"xx"},{"$f":"IF($C42=\"Ja\",INDEX(Grundkarakterer!I$8:I$41,$AE5),\"xx\")","v":"xx"},{"$f":"IF($C42=\"Ja\",INDEX(Grundkarakterer!J$8:J$41,$AE5),\"xx\")","v":"xx"},{"$f":"IF($C42=\"Ja\",INDEX(Grundkarakterer!K$8:K$41,$AE5),\"xx\")","v":"xx"},{"$f":"IF($C42=\"Ja\",INDEX(Grundkarakterer!L$8:L$41,$AE5),\"xx\")","v":"xx"},{"$f":"IF($C42=\"Ja\",INDEX(Grundkarakterer!M$8:M$41,$AE5),\"xx\")","v":"xx"},{"$f":"IF($C42=\"Ja\",INDEX(Grundkarakterer!N$8:N$41,$AE5),\"xx\")","v":"xx"},{"$f":"IF($C42=\"Ja\",INDEX(Grundkarakterer!O$8:O$41,$AE5),\"xx\")","v":"xx"},{"$f":"IF($C42=\"Ja\",INDEX(Grundkarakterer!P$8:P$41,$AE5),\"xx\")","v":"xx"},{"$f":"IF($C42=\"Ja\",INDEX(Grundkarakterer!Q$8:Q$41,$AE5),\"xx\")","v":"xx"},{"$f":"IF($C42=\"Ja\",INDEX(Grundkarakterer!R$8:R$41,$AE5),\"xx\")","v":"xx"},{"$f":"IF($C42=\"Ja\",INDEX(Grundkarakterer!S$8:S$41,$AE5),\"xx\")","v":"xx"},{"$f":"IF($C42=\"Ja\",INDEX(Grundkarakterer!T$8:T$41,$AE5),\"xx\")","v":"xx"},{"$f":"IF($C42=\"Ja\",INDEX(Grundkarakterer!U$8:U$41,$AE5),\"xx\")","v":"xx"},{"$f":"IF($C42=\"Ja\",INDEX(Grundkarakterer!V$8:V$41,$AE5),\"xx\")","v":"xx"},{"$f":"IF($C42=\"Ja\",INDEX(Grundkarakterer!W$8:W$41,$AE5),\"xx\")","v":"xx"},{"$f":"IF($C42=\"Ja\",INDEX(Grundkarakterer!X$8:X$41,$AE5),\"xx\")","v":"xx"},{"$f":"IF($C42=\"Ja\",INDEX(Grundkarakterer!Y$8:Y$41,$AE5),\"xx\")","v":"xx"},{"$f":"IF($C42=\"Ja\",INDEX(Grundkarakterer!Z$8:Z$41,$AE5),\"xx\")","v":"xx"},{"$f":"IF($C42=\"Ja\",INDEX(Grundkarakterer!AA$8:AA$41,$AE5),\"xx\")","v":"xx"},{"$f":"IF($C42=\"Ja\",INDEX(Grundkarakterer!AB$8:AB$41,$AE5),\"xx\")","v":"xx"},{"$f":"IF($C42=\"Ja\",INDEX(Grundkarakterer!AC$8:AC$41,$AE5),\"xx\")","v":"xx"},{"$f":"IF($C42=\"Ja\",INDEX(Grundkarakterer!G$8:G$41,$AE5),\"xx\")","v":"xx"}]
[4,{"$f":"INDEX(Grundkarakterer!A$8:A$41,AE6)","v":4},"Nej",{"$f":"IF(C43=\"Ja\",INDEX(Grundkarakterer!B$8:B$41,AE6),\"xx\")","v":"xx"},{"$f":"IF(C43=\"Ja\",INDEX(Grundkarakterer!C$8:C$41,$AE6),\"xx\")","v":"xx"},{"$f":"IF(C43=\"Ja\",INDEX(Grundkarakterer!D$8:D$41,$AE6),\"xx\")","v":"xx"},{"$f":"IF(C43=\"Ja\",INDEX(Grundkarakterer!E$8:E$41,$AE6),\"xx\")","v":"xx"},{"$f":"IF($C43=\"Ja\",INDEX(Grundkarakterer!F$8:F$41,$AE6),\"xx\")","v":"xx"},{"$f":"IF($C43=\"Ja\",INDEX(Grundkarakterer!H$8:H$41,$AE6),\"xx\")","v":"xx"},{"$f":"IF($C43=\"Ja\",INDEX(Grundkarakterer!I$8:I$41,$AE6),\"xx\")","v":"xx"},{"$f":"IF($C43=\"Ja\",INDEX(Grundkarakterer!J$8:J$41,$AE6),\"xx\")","v":"xx"},{"$f":"IF($C43=\"Ja\",INDEX(Grundkarakterer!K$8:K$41,$AE6),\"xx\")","v":"xx"},{"$f":"IF($C43=\"Ja\",INDEX(Grundkarakterer!L$8:L$41,$AE6),\"xx\")","v":"xx"},{"$f":"IF($C43=\"Ja\",INDEX(Grundkarakterer!M$8:M$41,$AE6),\"xx\")","v":"xx"},{"$f":"IF($C43=\"Ja\",INDEX(Grundkarakterer!N$8:N$41,$AE6),\"xx\")","v":"xx"},{"$f":"IF($C43=\"Ja\",INDEX(Grundkarakterer!O$8:O$41,$AE6),\"xx\")","v":"xx"},{"$f":"IF($C43=\"Ja\",INDEX(Grundkarakterer!P$8:P$41,$AE6),\"xx\")","v":"xx"},{"$f":"IF($C43=\"Ja\",INDEX(Grundkarakterer!Q$8:Q$41,$AE6),\"xx\")","v":"xx"},{"$f":"IF($C43=\"Ja\",INDEX(Grundkarakterer!R$8:R$41,$AE6),\"xx\")","v":"xx"},{"$f":"IF($C43=\"Ja\",INDEX(Grundkarakterer!S$8:S$41,$AE6),\"xx\")","v":"xx"},{"$f":"IF($C43=\"Ja\",INDEX(Grundkarakterer!T$8:T$41,$AE6),\"xx\")","v":"xx"},{"$f":"IF($C43=\"Ja\",INDEX(Grundkarakterer!U$8:U$41,$AE6),\"xx\")","v":"xx"},{"$f":"IF($C43=\"Ja\",INDEX(Grundkarakterer!V$8:V$41,$AE6),\"xx\")","v":"xx"},{"$f":"IF($C43=\"Ja\",INDEX(Grundkarakterer!W$8:W$41,$AE6),\"xx\")","v":"xx"},{"$f":"IF($C43=\"Ja\",INDEX(Grundkarakterer!X$8:X$41,$AE6),\"xx\")","v":"xx"},{"$f":"IF($C43=\"Ja\",INDEX(Grundkarakterer!Y$8:Y$41,$AE6),\"xx\")","v":"xx"},{"$f":"IF($C43=\"Ja\",INDEX(Grundkarakterer!Z$8:Z$41,$AE6),\"xx\")","v":"xx"},{"$f":"IF($C43=\"Ja\",INDEX(Grundkarakterer!AA$8:AA$41,$AE6),\"xx\")","v":"xx"},{"$f":"IF($C43=\"Ja\",INDEX(Grundkarakterer!AB$8:AB$41,$AE6),\"xx\")","v":"xx"},{"$f":"IF($C43=\"Ja\",INDEX(Grundkarakterer!AC$8:AC$41,$AE6),\"xx\")","v":"xx"},{"$f":"IF($C43=\"Ja\",INDEX(Grundkarakterer!G$8:G$41,$AE6),\"xx\")","v":"xx"}]
[5,{"$f":"INDEX(Grundkarakterer!A$8:A$41,AE7)","v":5},"Nej",{"$f":"IF(C44=\"Ja\",INDEX(Grundkarakterer!B$8:B$41,AE7),\"xx\")","v":"xx"},{"$f":"IF(C44=\"Ja\",INDEX(Grundkarakterer!C$8:C$41,$AE7),\"xx\")","v":"xx"},{"$f":"IF(C44=\"Ja\",INDEX(Grundkarakterer!D$8:D$41,$AE7),\"xx\")","v":"xx"},{"$f":"IF(C44=\"Ja\",INDEX(Grundkarakterer!E$8:E$41,$AE7),\"xx\")","v":"xx"},{"$f":"IF($C44=\"Ja\",INDEX(Grundkarakterer!F$8:F$41,$AE7),\"xx\")","v":"xx"},{"$f":"IF($C44=\"Ja\",INDEX(Grundkarakterer!H$8:H$41,$AE7),\"xx\")","v":"xx"},{"$f":"IF($C44=\"Ja\",INDEX(Grundkarakterer!I$8:I$41,$AE7),\"xx\")","v":"xx"},{"$f":"IF($C44=\"Ja\",INDEX(Grundkarakterer!J$8:J$41,$AE7),\"xx\")","v":"xx"},{"$f":"IF($C44=\"Ja\",INDEX(Grundkarakterer!K$8:K$41,$AE7),\"xx\")","v":"xx"},{"$f":"IF($C44=\"Ja\",INDEX(Grundkarakterer!L$8:L$41,$AE7),\"xx\")","v":"xx"},{"$f":"IF($C44=\"Ja\",INDEX(Grundkarakterer!M$8:M$41,$AE7),\"xx\")","v":"xx"},{"$f":"IF($C44=\"Ja\",INDEX(Grundkarakterer!N$8:N$41,$AE7),\"xx\")","v":"xx"},{"$f":"IF($C44=\"Ja\",INDEX(Grundkarakterer!O$8:O$41,$AE7),\"xx\")","v":"xx"},{"$f":"IF($C44=\"Ja\",INDEX(Grundkarakterer!P$8:P$41,$AE7),\"xx\")","v":"xx"},{"$f":"IF($C44=\"Ja\",INDEX(Grundkarakterer!Q$8:Q$41,$AE7),\"xx\")","v":"xx"},{"$f":"IF($C44=\"Ja\",INDEX(Grundkarakterer!R$8:R$41,$AE7),\"xx\")","v":"xx"},{"$f":"IF($C44=\"Ja\",INDEX(Grundkarakterer!S$8:S$41,$AE7),\"xx\")","v":"xx"},{"$f":"IF($C44=\"Ja\",INDEX(Grundkarakterer!T$8:T$41,$AE7),\"xx\")","v":"xx"},{"$f":"IF($C44=\"Ja\",INDEX(Grundkarakterer!U$8:U$41,$AE7),\"xx\")","v":"xx"},{"$f":"IF($C44=\"Ja\",INDEX(Grundkarakterer!V$8:V$41,$AE7),\"xx\")","v":"xx"},{"$f":"IF($C44=\"Ja\",INDEX(Grundkarakterer!W$8:W$41,$AE7),\"xx\")","v":"xx"},{"$f":"IF($C44=\"Ja\",INDEX(Grundkarakterer!X$8:X$41,$AE7),\"xx\")","v":"xx"},{"$f":"IF($C44=\"Ja\",INDEX(Grundkarakterer!Y$8:Y$41,$AE7),\"xx\")","v":"xx"},{"$f":"IF($C44=\"Ja\",INDEX(Grundkarakterer!Z$8:Z$41,$AE7),\"xx\")","v":"xx"},{"$f":"IF($C44=\"Ja\",INDEX(Grundkarakterer!AA$8:AA$41,$AE7),\"xx\")","v":"xx"},{"$f":"IF($C44=\"Ja\",INDEX(Grundkarakterer!AB$8:AB$41,$AE7),\"xx\")","v":"xx"},{"$f":"IF($C44=\"Ja\",INDEX(Grundkarakterer!AC$8:AC$41,$AE7),\"xx\")","v":"xx"},{"$f":"IF($C44=\"Ja\",INDEX(Grundkarakterer!G$8:G$41,$AE7),\"xx\")","v":"xx"}]
[6,{"$f":"INDEX(Grundkarakterer!A$8:A$41,AE8)","v":6},"Nej",{"$f":"IF(C45=\"Ja\",INDEX(Grundkarakterer!B$8:B$41,AE8),\"xx\")","v":"xx"},{"$f":"IF(C45=\"Ja\",INDEX(Grundkarakterer!C$8:C$41,$AE8),\"xx\")","v":"xx"},{"$f":"IF(C45=\"Ja\",INDEX(Grundkarakterer!D$8:D$41,$AE8),\"xx\")","v":"xx"},{"$f":"IF(C45=\"Ja\",INDEX(Grundkarakterer!E$8:E$41,$AE8),\"xx\")","v":"xx"},{"$f":"IF($C45=\"Ja\",INDEX(Grundkarakterer!F$8:F$41,$AE8),\"xx\")","v":"xx"},{"$f":"IF($C45=\"Ja\",INDEX(Grundkarakterer!H$8:H$41,$AE8),\"xx\")","v":"xx"},{"$f":"IF($C45=\"Ja\",INDEX(Grundkarakterer!I$8:I$41,$AE8),\"xx\")","v":"xx"},{"$f":"IF($C45=\"Ja\",INDEX(Grundkarakterer!J$8:J$41,$AE8),\"xx\")","v":"xx"},{"$f":"IF($C45=\"Ja\",INDEX(Grundkarakterer!K$8:K$41,$AE8),\"xx\")","v":"xx"},{"$f":"IF($C45=\"Ja\",INDEX(Grundkarakterer!L$8:L$41,$AE8),\"xx\")","v":"xx"},{"$f":"IF($C45=\"Ja\",INDEX(Grundkarakterer!M$8:M$41,$AE8),\"xx\")","v":"xx"},{"$f":"IF($C45=\"Ja\",INDEX(Grundkarakterer!N$8:N$41,$AE8),\"xx\")","v":"xx"},{"$f":"IF($C45=\"Ja\",INDEX(Grundkarakterer!O$8:O$41,$AE8),\"xx\")","v":"xx"},{"$f":"IF($C45=\"Ja\",INDEX(Grundkarakterer!P$8:P$41,$AE8),\"xx\")","v":"xx"},{"$f":"IF($C45=\"Ja\",INDEX(Grundkarakterer!Q$8:Q$41,$AE8),\"xx\")","v":"xx"},{"$f":"IF($C45=\"Ja\",INDEX(Grundkarakterer!R$8:R$41,$AE8),\"xx\")","v":"xx"},{"$f":"IF($C45=\"Ja\",INDEX(Grundkarakterer!S$8:S$41,$AE8),\"xx\")","v":"xx"},{"$f":"IF($C45=\"Ja\",INDEX(Grundkarakterer!T$8:T$41,$AE8),\"xx\")","v":"xx"},{"$f":"IF($C45=\"Ja\",INDEX(Grundkarakterer!U$8:U$41,$AE8),\"xx\")","v":"xx"},{"$f":"IF($C45=\"Ja\",INDEX(Grundkarakterer!V$8:V$41,$AE8),\"xx\")","v":"xx"},{"$f":"IF($C45=\"Ja\",INDEX(Grundkarakterer!W$8:W$41,$AE8),\"xx\")","v":"xx"},{"$f":"IF($C45=\"Ja\",INDEX(Grundkarakterer!X$8:X$41,$AE8),\"xx\")","v":"xx"},{"$f":"IF($C45=\"Ja\",INDEX(Grundkarakterer!Y$8:Y$41,$AE8),\"xx\")","v":"xx"},{"$f":"IF($C45=\"Ja\",INDEX(Grundkarakterer!Z$8:Z$41,$AE8),\"xx\")","v":"xx"},{"$f":"IF($C45=\"Ja\",INDEX(Grundkarakterer!AA$8:AA$41,$AE8),\"xx\")","v":"xx"},{"$f":"IF($C45=\"Ja\",INDEX(Grundkarakterer!AB$8:AB$41,$AE8),\"xx\")","v":"xx"},{"$f":"IF($C45=\"Ja\",INDEX(Grundkarakterer!AC$8:AC$41,$AE8),\"xx\")","v":"xx"},{"$f":"IF($C45=\"Ja\",INDEX(Grundkarakterer!G$8:G$41,$AE8),\"xx\")","v":"xx"}]
[7,{"$f":"INDEX(Grundkarakterer!A$8:A$41,AE9)","v":7},"Nej",{"$f":"IF(C46=\"Ja\",INDEX(Grundkarakterer!B$8:B$41,AE9),\"xx\")","v":"xx"},{"$f":"IF(C46=\"Ja\",INDEX(Grundkarakterer!C$8:C$41,$AE9),\"xx\")","v":"xx"},{"$f":"IF(C46=\"Ja\",INDEX(Grundkarakterer!D$8:D$41,$AE9),\"xx\")","v":"xx"},{"$f":"IF(C46=\"Ja\",INDEX(Grundkarakterer!E$8:E$41,$AE9),\"xx\")","v":"xx"},{"$f":"IF($C46=\"Ja\",INDEX(Grundkarakterer!F$8:F$41,$AE9),\"xx\")","v":"xx"},{"$f":"IF($C46=\"Ja\",INDEX(Grundkarakterer!H$8:H$41,$AE9),\"xx\")","v":"xx"},{"$f":"IF($C46=\"Ja\",INDEX(Grundkarakterer!I$8:I$41,$AE9),\"xx\")","v":"xx"},{"$f":"IF($C46=\"Ja\",INDEX(Grundkarakterer!J$8:J$41,$AE9),\"xx\")","v":"xx"},{"$f":"IF($C46=\"Ja\",INDEX(Grundkarakterer!K$8:K$41,$AE9),\"xx\")","v":"xx"},{"$f":"IF($C46=\"Ja\",INDEX(Grundkarakterer!L$8:L$41,$AE9),\"xx\")","v":"xx"},{"$f":"IF($C46=\"Ja\",INDEX(Grundkarakterer!M$8:M$41,$AE9),\"xx\")","v":"xx"},{"$f":"IF($C46=\"Ja\",INDEX(Grundkarakterer!N$8:N$41,$AE9),\"xx\")","v":"xx"},{"$f":"IF($C46=\"Ja\",INDEX(Grundkarakterer!O$8:O$41,$AE9),\"xx\")","v":"xx"},{"$f":"IF($C46=\"Ja\",INDEX(Grundkarakterer!P$8:P$41,$AE9),\"xx\")","v":"xx"},{"$f":"IF($C46=\"Ja\",INDEX(Grundkarakterer!Q$8:Q$41,$AE9),\"xx\")","v":"xx"},{"$f":"IF($C46=\"Ja\",INDEX(Grundkarakterer!R$8:R$41,$AE9),\"xx\")","v":"xx"},{"$f":"IF($C46=\"Ja\",INDEX(Grundkarakterer!S$8:S$41,$AE9),\"xx\")","v":"xx"},{"$f":"IF($C46=\"Ja\",INDEX(Grundkarakterer!T$8:T$41,$AE9),\"xx\")","v":"xx"},{"$f":"IF($C46=\"Ja\",INDEX(Grundkarakterer!U$8:U$41,$AE9),\"xx\")","v":"xx"},{"$f":"IF($C46=\"Ja\",INDEX(Grundkarakterer!V$8:V$41,$AE9),\"xx\")","v":"xx"},{"$f":"IF($C46=\"Ja\",INDEX(Grundkarakterer!W$8:W$41,$AE9),\"xx\")","v":"xx"},{"$f":"IF($C46=\"Ja\",INDEX(Grundkarakterer!X$8:X$41,$AE9),\"xx\")","v":"xx"},{"$f":"IF($C46=\"Ja\",INDEX(Grundkarakterer!Y$8:Y$41,$AE9),\"xx\")","v":"xx"},{"$f":"IF($C46=\"Ja\",INDEX(Grundkarakterer!Z$8:Z$41,$AE9),\"xx\")","v":"xx"},{"$f":"IF($C46=\"Ja\",INDEX(Grundkarakterer!AA$8:AA$41,$AE9),\"xx\")","v":"xx"},{"$f":"IF($C46=\"Ja\",INDEX(Grundkarakterer!AB$8:AB$41,$AE9),\"xx\")","v":"xx"},{"$f":"IF($C46=\"Ja\",INDEX(Grundkarakterer!AC$8:AC$41,$AE9),\"xx\")","v":"xx"},{"$f":"IF($C46=\"Ja\",INDEX(Grundkarakterer!G$8:G$41,$AE9),\"xx\")","v":"xx"}]
[8,{"$f":"INDEX(Grundkarakterer!A$8:A$41,AE10)","v":8},"Nej",{"$f":"IF(C47=\"Ja\",INDEX(Grundkarakterer!B$8:B$41,AE10),\"xx\")","v":"xx"},{"$f":"IF(C47=\"Ja\",INDEX(Grundkarakterer!C$8:C$41,$AE10),\"xx\")","v":"xx"},{"$f":"IF(C47=\"Ja\",INDEX(Grundkarakterer!D$8:D$41,$AE10),\"xx\")","v":"xx"},{"$f":"IF(C47=\"Ja\",INDEX(Grundkarakterer!E$8:E$41,$AE10),\"xx\")","v":"xx"},{"$f":"IF($C47=\"Ja\",INDEX(Grundkarakterer!F$8:F$41,$AE10),\"xx\")","v":"xx"},{"$f":"IF($C47=\"Ja\",INDEX(Grundkarakterer!H$8:H$41,$AE10),\"xx\")","v":"xx"},{"$f":"IF($C47=\"Ja\",INDEX(Grundkarakterer!I$8:I$41,$AE10),\"xx\")","v":"xx"},{"$f":"IF($C47=\"Ja\",INDEX(Grundkarakterer!J$8:J$41,$AE10),\"xx\")","v":"xx"},{"$f":"IF($C47=\"Ja\",INDEX(Grundkarakterer!K$8:K$41,$AE10),\"xx\")","v":"xx"},{"$f":"IF($C47=\"Ja\",INDEX(Grundkarakterer!L$8:L$41,$AE10),\"xx\")","v":"xx"},{"$f":"IF($C47=\"Ja\",INDEX(Grundkarakterer!M$8:M$41,$AE10),\"xx\")","v":"xx"},{"$f":"IF($C47=\"Ja\",INDEX(Grundkarakterer!N$8:N$41,$AE10),\"xx\")","v":"xx"},{"$f":"IF($C47=\"Ja\",INDEX(Grundkarakterer!O$8:O$41,$AE10),\"xx\")","v":"xx"},{"$f":"IF($C47=\"Ja\",INDEX(Grundkarakterer!P$8:P$41,$AE10),\"xx\")","v":"xx"},{"$f":"IF($C47=\"Ja\",INDEX(Grundkarakterer!Q$8:Q$41,$AE10),\"xx\")","v":"xx"},{"$f":"IF($C47=\"Ja\",INDEX(Grundkarakterer!R$8:R$41,$AE10),\"xx\")","v":"xx"},{"$f":"IF($C47=\"Ja\",INDEX(Grundkarakterer!S$8:S$41,$AE10),\"xx\")","v":"xx"},{"$f":"IF($C47=\"Ja\",INDEX(Grundkarakterer!T$8:T$41,$AE10),\"xx\")","v":"xx"},{"$f":"IF($C47=\"Ja\",INDEX(Grundkarakterer!U$8:U$41,$AE10),\"xx\")","v":"xx"},{"$f":"IF($C47=\"Ja\",INDEX(Grundkarakterer!V$8:V$41,$AE10),\"xx\")","v":"xx"},{"$f":"IF($C47=\"Ja\",INDEX(Grundkarakterer!W$8:W$41,$AE10),\"xx\")","v":"xx"},{"$f":"IF($C47=\"Ja\",INDEX(Grundkarakterer!X$8:X$41,$AE10),\"xx\")","v":"xx"},{"$f":"IF($C47=\"Ja\",INDEX(Grundkarakterer!Y$8:Y$41,$AE10),\"xx\")","v":"xx"},{"$f":"IF($C47=\"Ja\",INDEX(Grundkarakterer!Z$8:Z$41,$AE10),\"xx\")","v":"xx"},{"$f":"IF($C47=\"Ja\",INDEX(Grundkarakterer!AA$8:AA$41,$AE10),\"xx\")","v":"xx"},{"$f":"IF($C47=\"Ja\",INDEX(Grundkarakterer!AB$8:AB$41,$AE10),\"xx\")","v":"xx"},{"$f":"IF($C47=\"Ja\",INDEX(Grundkarakterer!AC$8:AC$41,$AE10),\"xx\")","v":"xx"},{"$f":"IF($C47=\"Ja\",INDEX(Grundkarakterer!G$8:G$41,$AE10),\"xx\")","v":"xx"}]
[9,{"$f":"INDEX(Grundkarakterer!A$8:A$41,AE11)","v":9},"Nej",{"$f":"IF(C48=\"Ja\",INDEX(Grundkarakterer!B$8:B$41,AE11),\"xx\")","v":"xx"},{"$f":"IF(C48=\"Ja\",INDEX(Grundkarakterer!C$8:C$41,$AE11),\"xx\")","v":"xx"},{"$f":"IF(C48=\"Ja\",INDEX(Grundkarakterer!D$8:D$41,$AE11),\"xx\")","v":"xx"},{"$f":"IF(C48=\"Ja\",INDEX(Grundkarakterer!E$8:E$41,$AE11),\"xx\")","v":"xx"},{"$f":"IF($C48=\"Ja\",INDEX(Grundkarakterer!F$8:F$41,$AE11),\"xx\")","v":"xx"},{"$f":"IF($C48=\"Ja\",INDEX(Grundkarakterer!H$8:H$41,$AE11),\"xx\")","v":"xx"},{"$f":"IF($C48=\"Ja\",INDEX(Grundkarakterer!I$8:I$41,$AE11),\"xx\")","v":"xx"},{"$f":"IF($C48=\"Ja\",INDEX(Grundkarakterer!J$8:J$41,$AE11),\"xx\")","v":"xx"},{"$f":"IF($C48=\"Ja\",INDEX(Grundkarakterer!K$8:K$41,$AE11),\"xx\")","v":"xx"},{"$f":"IF($C48=\"Ja\",INDEX(Grundkarakterer!L$8:L$41,$AE11),\"xx\")","v":"xx"},{"$f":"IF($C48=\"Ja\",INDEX(Grundkarakterer!M$8:M$41,$AE11),\"xx\")","v":"xx"},{"$f":"IF($C48=\"Ja\",INDEX(Grundkarakterer!N$8:N$41,$AE11),\"xx\")","v":"xx"},{"$f":"IF($C48=\"Ja\",INDEX(Grundkarakterer!O$8:O$41,$AE11),\"xx\")","v":"xx"},{"$f":"IF($C48=\"Ja\",INDEX(Grundkarakterer!P$8:P$41,$AE11),\"xx\")","v":"xx"},{"$f":"IF($C48=\"Ja\",INDEX(Grundkarakterer!Q$8:Q$41,$AE11),\"xx\")","v":"xx"},{"$f":"IF($C48=\"Ja\",INDEX(Grundkarakterer!R$8:R$41,$AE11),\"xx\")","v":"xx"},{"$f":"IF($C48=\"Ja\",INDEX(Grundkarakterer!S$8:S$41,$AE11),\"xx\")","v":"xx"},{"$f":"IF($C48=\"Ja\",INDEX(Grundkarakterer!T$8:T$41,$AE11),\"xx\")","v":"xx"},{"$f":"IF($C48=\"Ja\",INDEX(Grundkarakterer!U$8:U$41,$AE11),\"xx\")","v":"xx"},{"$f":"IF($C48=\"Ja\",INDEX(Grundkarakterer!V$8:V$41,$AE11),\"xx\")","v":"xx"},{"$f":"IF($C48=\"Ja\",INDEX(Grundkarakterer!W$8:W$41,$AE11),\"xx\")","v":"xx"},{"$f":"IF($C48=\"Ja\",INDEX(Grundkarakterer!X$8:X$41,$AE11),\"xx\")","v":"xx"},{"$f":"IF($C48=\"Ja\",INDEX(Grundkarakterer!Y$8:Y$41,$AE11),\"xx\")","v":"xx"},{"$f":"IF($C48=\"Ja\",INDEX(Grundkarakterer!Z$8:Z$41,$AE11),\"xx\")","v":"xx"},{"$f":"IF($C48=\"Ja\",INDEX(Grundkarakterer!AA$8:AA$41,$AE11),\"xx\")","v":"xx"},{"$f":"IF($C48=\"Ja\",INDEX(Grundkarakterer!AB$8:AB$41,$AE11),\"xx\")","v":"xx"},{"$f":"IF($C48=\"Ja\",INDEX(Grundkarakterer!AC$8:AC$41,$AE11),\"xx\")","v":"xx"},{"$f":"IF($C48=\"Ja\",INDEX(Grundkarakterer!G$8:G$41,$AE11),\"xx\")","v":"xx"}]
[10,{"$f":"INDEX(Grundkarakterer!A$8:A$41,AE12)","v":10},"Nej",{"$f":"IF(C49=\"Ja\",INDEX(Grundkarakterer!B$8:B$41,AE12),\"xx\")","v":"xx"},{"$f":"IF(C49=\"Ja\",INDEX(Grundkarakterer!C$8:C$41,$AE12),\"xx\")","v":"xx"},{"$f":"IF(C49=\"Ja\",INDEX(Grundkarakterer!D$8:D$41,$AE12),\"xx\")","v":"xx"},{"$f":"IF(C49=\"Ja\",INDEX(Grundkarakterer!E$8:E$41,$AE12),\"xx\")","v":"xx"},{"$f":"IF($C49=\"Ja\",INDEX(Grundkarakterer!F$8:F$41,$AE12),\"xx\")","v":"xx"},{"$f":"IF($C49=\"Ja\",INDEX(Grundkarakterer!H$8:H$41,$AE12),\"xx\")","v":"xx"},{"$f":"IF($C49=\"Ja\",INDEX(Grundkarakterer!I$8:I$41,$AE12),\"xx\")","v":"xx"},{"$f":"IF($C49=\"Ja\",INDEX(Grundkarakterer!J$8:J$41,$AE12),\"xx\")","v":"xx"},{"$f":"IF($C49=\"Ja\",INDEX(Grundkarakterer!K$8:K$41,$AE12),\"xx\")","v":"xx"},{"$f":"IF($C49=\"Ja\",INDEX(Grundkarakterer!L$8:L$41,$AE12),\"xx\")","v":"xx"},{"$f":"IF($C49=\"Ja\",INDEX(Grundkarakterer!M$8:M$41,$AE12),\"xx\")","v":"xx"},{"$f":"IF($C49=\"Ja\",INDEX(Grundkarakterer!N$8:N$41,$AE12),\"xx\")","v":"xx"},{"$f":"IF($C49=\"Ja\",INDEX(Grundkarakterer!O$8:O$41,$AE12),\"xx\")","v":"xx"},{"$f":"IF($C49=\"Ja\",INDEX(Grundkarakterer!P$8:P$41,$AE12),\"xx\")","v":"xx"},{"$f":"IF($C49=\"Ja\",INDEX(Grundkarakterer!Q$8:Q$41,$AE12),\"xx\")","v":"xx"},{"$f":"IF($C49=\"Ja\",INDEX(Grundkarakterer!R$8:R$41,$AE12),\"xx\")","v":"xx"},{"$f":"IF($C49=\"Ja\",INDEX(Grundkarakterer!S$8:S$41,$AE12),\"xx\")","v":"xx"},{"$f":"IF($C49=\"Ja\",INDEX(Grundkarakterer!T$8:T$41,$AE12),\"xx\")","v":"xx"},{"$f":"IF($C49=\"Ja\",INDEX(Grundkarakterer!U$8:U$41,$AE12),\"xx\")","v":"xx"},{"$f":"IF($C49=\"Ja\",INDEX(Grundkarakterer!V$8:V$41,$AE12),\"xx\")","v":"xx"},{"$f":"IF($C49=\"Ja\",INDEX(Grundkarakterer!W$8:W$41,$AE12),\"xx\")","v":"xx"},{"$f":"IF($C49=\"Ja\",INDEX(Grundkarakterer!X$8:X$41,$AE12),\"xx\")","v":"xx"},{"$f":"IF($C49=\"Ja\",INDEX(Grundkarakterer!Y$8:Y$41,$AE12),\"xx\")","v":"xx"},{"$f":"IF($C49=\"Ja\",INDEX(Grundkarakterer!Z$8:Z$41,$AE12),\"xx\")","v":"xx"},{"$f":"IF($C49=\"Ja\",INDEX(Grundkarakterer!AA$8:AA$41,$AE12),\"xx\")","v":"xx"},{"$f":"IF($C49=\"Ja\",INDEX(Grundkarakterer!AB$8:AB$41,$AE12),\"xx\")","v":"xx"},{"$f":"IF($C49=\"Ja\",INDEX(Grundkarakterer!AC$8:AC$41,$AE12),\"xx\")","v":"xx"},{"$f":"IF($C49=\"Ja\",INDEX(Grundkarakterer!G$8:G$41,$AE12),\"xx\")","v":"xx"}]
[11,{"$f":"INDEX(Grundkarakterer!A$8:A$41,AE13)","v":11},"Nej",{"$f":"IF(C50=\"Ja\",INDEX(Grundkarakterer!B$8:B$41,AE13),\"xx\")","v":"xx"},{"$f":"IF(C50=\"Ja\",INDEX(Grundkarakterer!C$8:C$41,$AE13),\"xx\")","v":"xx"},{"$f":"IF(C50=\"Ja\",INDEX(Grundkarakterer!D$8:D$41,$AE13),\"xx\")","v":"xx"},{"$f":"IF(C50=\"Ja\",INDEX(Grundkarakterer!E$8:E$41,$AE13),\"xx\")","v":"xx"},{"$f":"IF($C50=\"Ja\",INDEX(Grundkarakterer!F$8:F$41,$AE13),\"xx\")","v":"xx"},{"$f":"IF($C50=\"Ja\",INDEX(Grundkarakterer!H$8:H$41,$AE13),\"xx\")","v":"xx"},{"$f":"IF($C50=\"Ja\",INDEX(Grundkarakterer!I$8:I$41,$AE13),\"xx\")","v":"xx"},{"$f":"IF($C50=\"Ja\",INDEX(Grundkarakterer!J$8:J$41,$AE13),\"xx\")","v":"xx"},{"$f":"IF($C50=\"Ja\",INDEX(Grundkarakterer!K$8:K$41,$AE13),\"xx\")","v":"xx"},{"$f":"IF($C50=\"Ja\",INDEX(Grundkarakterer!L$8:L$41,$AE13),\"xx\")","v":"xx"},{"$f":"IF($C50=\"Ja\",INDEX(Grundkarakterer!M$8:M$41,$AE13),\"xx\")","v":"xx"},{"$f":"IF($C50=\"Ja\",INDEX(Grundkarakterer!N$8:N$41,$AE13),\"xx\")","v":"xx"},{"$f":"IF($C50=\"Ja\",INDEX(Grundkarakterer!O$8:O$41,$AE13),\"xx\")","v":"xx"},{"$f":"IF($C50=\"Ja\",INDEX(Grundkarakterer!P$8:P$41,$AE13),\"xx\")","v":"xx"},{"$f":"IF($C50=\"Ja\",INDEX(Grundkarakterer!Q$8:Q$41,$AE13),\"xx\")","v":"xx"},{"$f":"IF($C50=\"Ja\",INDEX(Grundkarakterer!R$8:R$41,$AE13),\"xx\")","v":"xx"},{"$f":"IF($C50=\"Ja\",INDEX(Grundkarakterer!S$8:S$41,$AE13),\"xx\")","v":"xx"},{"$f":"IF($C50=\"Ja\",INDEX(Grundkarakterer!T$8:T$41,$AE13),\"xx\")","v":"xx"},{"$f":"IF($C50=\"Ja\",INDEX(Grundkarakterer!U$8:U$41,$AE13),\"xx\")","v":"xx"},{"$f":"IF($C50=\"Ja\",INDEX(Grundkarakterer!V$8:V$41,$AE13),\"xx\")","v":"xx"},{"$f":"IF($C50=\"Ja\",INDEX(Grundkarakterer!W$8:W$41,$AE13),\"xx\")","v":"xx"},{"$f":"IF($C50=\"Ja\",INDEX(Grundkarakterer!X$8:X$41,$AE13),\"xx\")","v":"xx"},{"$f":"IF($C50=\"Ja\",INDEX(Grundkarakterer!Y$8:Y$41,$AE13),\"xx\")","v":"xx"},{"$f":"IF($C50=\"Ja\",INDEX(Grundkarakterer!Z$8:Z$41,$AE13),\"xx\")","v":"xx"},{"$f":"IF($C50=\"Ja\",INDEX(Grundkarakterer!AA$8:AA$41,$AE13),\"xx\")","v":"xx"},{"$f":"IF($C50=\"Ja\",INDEX(Grundkarakterer!AB$8:AB$41,$AE13),\"xx\")","v":"xx"},{"$f":"IF($C50=\"Ja\",INDEX(Grundkarakterer!AC$8:AC$41,$AE13),\"xx\")","v":"xx"},{"$f":"IF($C50=\"Ja\",INDEX(Grundkarakterer!G$8:G$41,$AE13),\"xx\")","v":"xx"}]
[12,{"$f":"INDEX(Grundkarakterer!A$8:A$41,AE14)","v":12},"Nej",{"$f":"IF(C51=\"Ja\",INDEX(Grundkarakterer!B$8:B$41,AE14),\"xx\")","v":"xx"},{"$f":"IF(C51=\"Ja\",INDEX(Grundkarakterer!C$8:C$41,$AE14),\"xx\")","v":"xx"},{"$f":"IF(C51=\"Ja\",INDEX(Grundkarakterer!D$8:D$41,$AE14),\"xx\")","v":"xx"},{"$f":"IF(C51=\"Ja\",INDEX(Grundkarakterer!E$8:E$41,$AE14),\"xx\")","v":"xx"},{"$f":"IF($C51=\"Ja\",INDEX(Grundkarakterer!F$8:F$41,$AE14),\"xx\")","v":"xx"},{"$f":"IF($C51=\"Ja\",INDEX(Grundkarakterer!H$8:H$41,$AE14),\"xx\")","v":"xx"},{"$f":"IF($C51=\"Ja\",INDEX(Grundkarakterer!I$8:I$41,$AE14),\"xx\")","v":"xx"},{"$f":"IF($C51=\"Ja\",INDEX(Grundkarakterer!J$8:J$41,$AE14),\"xx\")","v":"xx"},{"$f":"IF($C51=\"Ja\",INDEX(Grundkarakterer!K$8:K$41,$AE14),\"xx\")","v":"xx"},{"$f":"IF($C51=\"Ja\",INDEX(Grundkarakterer!L$8:L$41,$AE14),\"xx\")","v":"xx"},{"$f":"IF($C51=\"Ja\",INDEX(Grundkarakterer!M$8:M$41,$AE14),\"xx\")","v":"xx"},{"$f":"IF($C51=\"Ja\",INDEX(Grundkarakterer!N$8:N$41,$AE14),\"xx\")","v":"xx"},{"$f":"IF($C51=\"Ja\",INDEX(Grundkarakterer!O$8:O$41,$AE14),\"xx\")","v":"xx"},{"$f":"IF($C51=\"Ja\",INDEX(Grundkarakterer!P$8:P$41,$AE14),\"xx\")","v":"xx"},{"$f":"IF($C51=\"Ja\",INDEX(Grundkarakterer!Q$8:Q$41,$AE14),\"xx\")","v":"xx"},{"$f":"IF($C51=\"Ja\",INDEX(Grundkarakterer!R$8:R$41,$AE14),\"xx\")","v":"xx"},{"$f":"IF($C51=\"Ja\",INDEX(Grundkarakterer!S$8:S$41,$AE14),\"xx\")","v":"xx"},{"$f":"IF($C51=\"Ja\",INDEX(Grundkarakterer!T$8:T$41,$AE14),\"xx\")","v":"xx"},{"$f":"IF($C51=\"Ja\",INDEX(Grundkarakterer!U$8:U$41,$AE14),\"xx\")","v":"xx"},{"$f":"IF($C51=\"Ja\",INDEX(Grundkarakterer!V$8:V$41,$AE14),\"xx\")","v":"xx"},{"$f":"IF($C51=\"Ja\",INDEX(Grundkarakterer!W$8:W$41,$AE14),\"xx\")","v":"xx"},{"$f":"IF($C51=\"Ja\",INDEX(Grundkarakterer!X$8:X$41,$AE14),\"xx\")","v":"xx"},{"$f":"IF($C51=\"Ja\",INDEX(Grundkarakterer!Y$8:Y$41,$AE14),\"xx\")","v":"xx"},{"$f":"IF($C51=\"Ja\",INDEX(Grundkarakterer!Z$8:Z$41,$AE14),\"xx\")","v":"xx"},{"$f":"IF($C51=\"Ja\",INDEX(Grundkarakterer!AA$8:AA$41,$AE14),\"xx\")","v":"xx"},{"$f":"IF($C51=\"Ja\",INDEX(Grundkarakterer!AB$8:AB$41,$AE14),\"xx\")","v":"xx"},{"$f":"IF($C51=\"Ja\",INDEX(Grundkarakterer!AC$8:AC$41,$AE14),\"xx\")","v":"xx"},{"$f":"IF($C51=\"Ja\",INDEX(Grundkarakterer!G$8:G$41,$AE14),\"xx\")","v":"xx"}]
[13,{"$f":"INDEX(Grundkarakterer!A$8:A$41,AE15)","v":13},"Nej",{"$f":"IF(C52=\"Ja\",INDEX(Grundkarakterer!B$8:B$41,AE15),\"xx\")","v":"xx"},{"$f":"IF(C52=\"Ja\",INDEX(Grundkarakterer!C$8:C$41,$AE15),\"xx\")","v":"xx"},{"$f":"IF(C52=\"Ja\",INDEX(Grundkarakterer!D$8:D$41,$AE15),\"xx\")","v":"xx"},{"$f":"IF(C52=\"Ja\",INDEX(Grundkarakterer!E$8:E$41,$AE15),\"xx\")","v":"xx"},{"$f":"IF($C52=\"Ja\",INDEX(Grundkarakterer!F$8:F$41,$AE15),\"xx\")","v":"xx"},{"$f":"IF($C52=\"Ja\",INDEX(Grundkarakterer!H$8:H$41,$AE15),\"xx\")","v":"xx"},{"$f":"IF($C52=\"Ja\",INDEX(Grundkarakterer!I$8:I$41,$AE15),\"xx\")","v":"xx"},{"$f":"IF($C52=\"Ja\",INDEX(Grundkarakterer!J$8:J$41,$AE15),\"xx\")","v":"xx"},{"$f":"IF($C52=\"Ja\",INDEX(Grundkarakterer!K$8:K$41,$AE15),\"xx\")","v":"xx"},{"$f":"IF($C52=\"Ja\",INDEX(Grundkarakterer!L$8:L$41,$AE15),\"xx\")","v":"xx"},{"$f":"IF($C52=\"Ja\",INDEX(Grundkarakterer!M$8:M$41,$AE15),\"xx\")","v":"xx"},{"$f":"IF($C52=\"Ja\",INDEX(Grundkarakterer!N$8:N$41,$AE15),\"xx\")","v":"xx"},{"$f":"IF($C52=\"Ja\",INDEX(Grundkarakterer!O$8:O$41,$AE15),\"xx\")","v":"xx"},{"$f":"IF($C52=\"Ja\",INDEX(Grundkarakterer!P$8:P$41,$AE15),\"xx\")","v":"xx"},{"$f":"IF($C52=\"Ja\",INDEX(Grundkarakterer!Q$8:Q$41,$AE15),\"xx\")","v":"xx"},{"$f":"IF($C52=\"Ja\",INDEX(Grundkarakterer!R$8:R$41,$AE15),\"xx\")","v":"xx"},{"$f":"IF($C52=\"Ja\",INDEX(Grundkarakterer!S$8:S$41,$AE15),\"xx\")","v":"xx"},{"$f":"IF($C52=\"Ja\",INDEX(Grundkarakterer!T$8:T$41,$AE15),\"xx\")","v":"xx"},{"$f":"IF($C52=\"Ja\",INDEX(Grundkarakterer!U$8:U$41,$AE15),\"xx\")","v":"xx"},{"$f":"IF($C52=\"Ja\",INDEX(Grundkarakterer!V$8:V$41,$AE15),\"xx\")","v":"xx"},{"$f":"IF($C52=\"Ja\",INDEX(Grundkarakterer!W$8:W$41,$AE15),\"xx\")","v":"xx"},{"$f":"IF($C52=\"Ja\",INDEX(Grundkarakterer!X$8:X$41,$AE15),\"xx\")","v":"xx"},{"$f":"IF($C52=\"Ja\",INDEX(Grundkarakterer!Y$8:Y$41,$AE15),\"xx\")","v":"xx"},{"$f":"IF($C52=\"Ja\",INDEX(Grundkarakterer!Z$8:Z$41,$AE15),\"xx\")","v":"xx"},{"$f":"IF($C52=\"Ja\",INDEX(Grundkarakterer!AA$8:AA$41,$AE15),\"xx\")","v":"xx"},{"$f":"IF($C52=\"Ja\",INDEX(Grundkarakterer!AB$8:AB$41,$AE15),\"xx\")","v":"xx"},{"$f":"IF($C52=\"Ja\",INDEX(Grundkarakterer!AC$8:AC$41,$AE15),\"xx\")","v":"xx"},{"$f":"IF($C52=\"Ja\",INDEX(Grundkarakterer!G$8:G$41,$AE15),\"xx\")","v":"xx"}]
[14,{"$f":"INDEX(Grundkarakterer!A$8:A$41,AE16)","v":14},"Nej",{"$f":"IF(C53=\"Ja\",INDEX(Grundkarakterer!B$8:B$41,AE16),\"xx\")","v":"xx"},{"$f":"IF(C53=\"Ja\",INDEX(Grundkarakterer!C$8:C$41,$AE16),\"xx\")","v":"xx"},{"$f":"IF(C53=\"Ja\",INDEX(Grundkarakterer!D$8:D$41,$AE16),\"xx\")","v":"xx"},{"$f":"IF(C53=\"Ja\",INDEX(Grundkarakterer!E$8:E$41,$AE16),\"xx\")","v":"xx"},{"$f":"IF($C53=\"Ja\",INDEX(Grundkarakterer!F$8:F$41,$AE16),\"xx\")","v":"xx"},{"$f":"IF($C53=\"Ja\",INDEX(Grundkarakterer!H$8:H$41,$AE16),\"xx\")","v":"xx"},{"$f":"IF($C53=\"Ja\",INDEX(Grundkarakterer!I$8:I$41,$AE16),\"xx\")","v":"xx"},{"$f":"IF($C53=\"Ja\",INDEX(Grundkarakterer!J$8:J$41,$AE16),\"xx\")","v":"xx"},{"$f":"IF($C53=\"Ja\",INDEX(Grundkarakterer!K$8:K$41,$AE16),\"xx\")","v":"xx"},{"$f":"IF($C53=\"Ja\",INDEX(Grundkarakterer!L$8:L$41,$AE16),\"xx\")","v":"xx"},{"$f":"IF($C53=\"Ja\",INDEX(Grundkarakterer!M$8:M$41,$AE16),\"xx\")","v":"xx"},{"$f":"IF($C53=\"Ja\",INDEX(Grundkarakterer!N$8:N$41,$AE16),\"xx\")","v":"xx"},{"$f":"IF($C53=\"Ja\",INDEX(Grundkarakterer!O$8:O$41,$AE16),\"xx\")","v":"xx"},{"$f":"IF($C53=\"Ja\",INDEX(Grundkarakterer!P$8:P$41,$AE16),\"xx\")","v":"xx"},{"$f":"IF($C53=\"Ja\",INDEX(Grundkarakterer!Q$8:Q$41,$AE16),\"xx\")","v":"xx"},{"$f":"IF($C53=\"Ja\",INDEX(Grundkarakterer!R$8:R$41,$AE16),\"xx\")","v":"xx"},{"$f":"IF($C53=\"Ja\",INDEX(Grundkarakterer!S$8:S$41,$AE16),\"xx\")","v":"xx"},{"$f":"IF($C53=\"Ja\",INDEX(Grundkarakterer!T$8:T$41,$AE16),\"xx\")","v":"xx"},{"$f":"IF($C53=\"Ja\",INDEX(Grundkarakterer!U$8:U$41,$AE16),\"xx\")","v":"xx"},{"$f":"IF($C53=\"Ja\",INDEX(Grundkarakterer!V$8:V$41,$AE16),\"xx\")","v":"xx"},{"$f":"IF($C53=\"Ja\",INDEX(Grundkarakterer!W$8:W$41,$AE16),\"xx\")","v":"xx"},{"$f":"IF($C53=\"Ja\",INDEX(Grundkarakterer!X$8:X$41,$AE16),\"xx\")","v":"xx"},{"$f":"IF($C53=\"Ja\",INDEX(Grundkarakterer!Y$8:Y$41,$AE16),\"xx\")","v":"xx"},{"$f":"IF($C53=\"Ja\",INDEX(Grundkarakterer!Z$8:Z$41,$AE16),\"xx\")","v":"xx"},{"$f":"IF($C53=\"Ja\",INDEX(Grundkarakterer!AA$8:AA$41,$AE16),\"xx\")","v":"xx"},{"$f":"IF($C53=\"Ja\",INDEX(Grundkarakterer!AB$8:AB$41,$AE16),\"xx\")","v":"xx"},{"$f":"IF($C53=\"Ja\",INDEX(Grundkarakterer!AC$8:AC$41,$AE16),\"xx\")","v":"xx"},{"$f":"IF($C53=\"Ja\",INDEX(Grundkarakterer!G$8:G$41,$AE16),\"xx\")","v":"xx"}]
[15,{"$f":"INDEX(Grundkarakterer!A$8:A$41,AE17)","v":15},"Nej",{"$f":"IF(C54=\"Ja\",INDEX(Grundkarakterer!B$8:B$41,AE17),\"xx\")","v":"xx"},{"$f":"IF(C54=\"Ja\",INDEX(Grundkarakterer!C$8:C$41,$AE17),\"xx\")","v":"xx"},{"$f":"IF(C54=\"Ja\",INDEX(Grundkarakterer!D$8:D$41,$AE17),\"xx\")","v":"xx"},{"$f":"IF(C54=\"Ja\",INDEX(Grundkarakterer!E$8:E$41,$AE17),\"xx\")","v":"xx"},{"$f":"IF($C54=\"Ja\",INDEX(Grundkarakterer!F$8:F$41,$AE17),\"xx\")","v":"xx"},{"$f":"IF($C54=\"Ja\",INDEX(Grundkarakterer!H$8:H$41,$AE17),\"xx\")","v":"xx"},{"$f":"IF($C54=\"Ja\",INDEX(Grundkarakterer!I$8:I$41,$AE17),\"xx\")","v":"xx"},{"$f":"IF($C54=\"Ja\",INDEX(Grundkarakterer!J$8:J$41,$AE17),\"xx\")","v":"xx"},{"$f":"IF($C54=\"Ja\",INDEX(Grundkarakterer!K$8:K$41,$AE17),\"xx\")","v":"xx"},{"$f":"IF($C54=\"Ja\",INDEX(Grundkarakterer!L$8:L$41,$AE17),\"xx\")","v":"xx"},{"$f":"IF($C54=\"Ja\",INDEX(Grundkarakterer!M$8:M$41,$AE17),\"xx\")","v":"xx"},{"$f":"IF($C54=\"Ja\",INDEX(Grundkarakterer!N$8:N$41,$AE17),\"xx\")","v":"xx"},{"$f":"IF($C54=\"Ja\",INDEX(Grundkarakterer!O$8:O$41,$AE17),\"xx\")","v":"xx"},{"$f":"IF($C54=\"Ja\",INDEX(Grundkarakterer!P$8:P$41,$AE17),\"xx\")","v":"xx"},{"$f":"IF($C54=\"Ja\",INDEX(Grundkarakterer!Q$8:Q$41,$AE17),\"xx\")","v":"xx"},{"$f":"IF($C54=\"Ja\",INDEX(Grundkarakterer!R$8:R$41,$AE17),\"xx\")","v":"xx"},{"$f":"IF($C54=\"Ja\",INDEX(Grundkarakterer!S$8:S$41,$AE17),\"xx\")","v":"xx"},{"$f":"IF($C54=\"Ja\",INDEX(Grundkarakterer!T$8:T$41,$AE17),\"xx\")","v":"xx"},{"$f":"IF($C54=\"Ja\",INDEX(Grundkarakterer!U$8:U$41,$AE17),\"xx\")","v":"xx"},{"$f":"IF($C54=\"Ja\",INDEX(Grundkarakterer!V$8:V$41,$AE17),\"xx\")","v":"xx"},{"$f":"IF($C54=\"Ja\",INDEX(Grundkarakterer!W$8:W$41,$AE17),\"xx\")","v":"xx"},{"$f":"IF($C54=\"Ja\",INDEX(Grundkarakterer!X$8:X$41,$AE17),\"xx\")","v":"xx"},{"$f":"IF($C54=\"Ja\",INDEX(Grundkarakterer!Y$8:Y$41,$AE17),\"xx\")","v":"xx"},{"$f":"IF($C54=\"Ja\",INDEX(Grundkarakterer!Z$8:Z$41,$AE17),\"xx\")","v":"xx"},{"$f":"IF($C54=\"Ja\",INDEX(Grundkarakterer!AA$8:AA$41,$AE17),\"xx\")","v":"xx"},{"$f":"IF($C54=\"Ja\",INDEX(Grundkarakterer!AB$8:AB$41,$AE17),\"xx\")","v":"xx"},{"$f":"IF($C54=\"Ja\",INDEX(Grundkarakterer!AC$8:AC$41,$AE17),\"xx\")","v":"xx"},{"$f":"IF($C54=\"Ja\",INDEX(Grundkarakterer!G$8:G$41,$AE17),\"xx\")","v":"xx"}]
[16,{"$f":"INDEX(Grundkarakterer!A$8:A$41,AE18)","v":16},"Nej",{"$f":"IF(C55=\"Ja\",INDEX(Grundkarakterer!B$8:B$41,AE18),\"xx\")","v":"xx"},{"$f":"IF(C55=\"Ja\",INDEX(Grundkarakterer!C$8:C$41,$AE18),\"xx\")","v":"xx"},{"$f":"IF(C55=\"Ja\",INDEX(Grundkarakterer!D$8:D$41,$AE18),\"xx\")","v":"xx"},{"$f":"IF(C55=\"Ja\",INDEX(Grundkarakterer!E$8:E$41,$AE18),\"xx\")","v":"xx"},{"$f":"IF($C55=\"Ja\",INDEX(Grundkarakterer!F$8:F$41,$AE18),\"xx\")","v":"xx"},{"$f":"IF($C55=\"Ja\",INDEX(Grundkarakterer!H$8:H$41,$AE18),\"xx\")","v":"xx"},{"$f":"IF($C55=\"Ja\",INDEX(Grundkarakterer!I$8:I$41,$AE18),\"xx\")","v":"xx"},{"$f":"IF($C55=\"Ja\",INDEX(Grundkarakterer!J$8:J$41,$AE18),\"xx\")","v":"xx"},{"$f":"IF($C55=\"Ja\",INDEX(Grundkarakterer!K$8:K$41,$AE18),\"xx\")","v":"xx"},{"$f":"IF($C55=\"Ja\",INDEX(Grundkarakterer!L$8:L$41,$AE18),\"xx\")","v":"xx"},{"$f":"IF($C55=\"Ja\",INDEX(Grundkarakterer!M$8:M$41,$AE18),\"xx\")","v":"xx"},{"$f":"IF($C55=\"Ja\",INDEX(Grundkarakterer!N$8:N$41,$AE18),\"xx\")","v":"xx"},{"$f":"IF($C55=\"Ja\",INDEX(Grundkarakterer!O$8:O$41,$AE18),\"xx\")","v":"xx"},{"$f":"IF($C55=\"Ja\",INDEX(Grundkarakterer!P$8:P$41,$AE18),\"xx\")","v":"xx"},{"$f":"IF($C55=\"Ja\",INDEX(Grundkarakterer!Q$8:Q$41,$AE18),\"xx\")","v":"xx"},{"$f":"IF($C55=\"Ja\",INDEX(Grundkarakterer!R$8:R$41,$AE18),\"xx\")","v":"xx"},{"$f":"IF($C55=\"Ja\",INDEX(Grundkarakterer!S$8:S$41,$AE18),\"xx\")","v":"xx"},{"$f":"IF($C55=\"Ja\",INDEX(Grundkarakterer!T$8:T$41,$AE18),\"xx\")","v":"xx"},{"$f":"IF($C55=\"Ja\",INDEX(Grundkarakterer!U$8:U$41,$AE18),\"xx\")","v":"xx"},{"$f":"IF($C55=\"Ja\",INDEX(Grundkarakterer!V$8:V$41,$AE18),\"xx\")","v":"xx"},{"$f":"IF($C55=\"Ja\",INDEX(Grundkarakterer!W$8:W$41,$AE18),\"xx\")","v":"xx"},{"$f":"IF($C55=\"Ja\",INDEX(Grundkarakterer!X$8:X$41,$AE18),\"xx\")","v":"xx"},{"$f":"IF($C55=\"Ja\",INDEX(Grundkarakterer!Y$8:Y$41,$AE18),\"xx\")","v":"xx"},{"$f":"IF($C55=\"Ja\",INDEX(Grundkarakterer!Z$8:Z$41,$AE18),\"xx\")","v":"xx"},{"$f":"IF($C55=\"Ja\",INDEX(Grundkarakterer!AA$8:AA$41,$AE18),\"xx\")","v":"xx"},{"$f":"IF($C55=\"Ja\",INDEX(Grundkarakterer!AB$8:AB$41,$AE18),\"xx\")","v":"xx"},{"$f":"IF($C55=\"Ja\",INDEX(Grundkarakterer!AC$8:AC$41,$AE18),\"xx\")","v":"xx"},{"$f":"IF($C55=\"Ja\",INDEX(Grundkarakterer!G$8:G$41,$AE18),\"xx\")","v":"xx"}]
[17,{"$f":"INDEX(Grundkarakterer!A$8:A$41,AE19)","v":17},"Nej",{"$f":"IF(C56=\"Ja\",INDEX(Grundkarakterer!B$8:B$41,AE19),\"xx\")","v":"xx"},{"$f":"IF(C56=\"Ja\",INDEX(Grundkarakterer!C$8:C$41,$AE19),\"xx\")","v":"xx"},{"$f":"IF(C56=\"Ja\",INDEX(Grundkarakterer!D$8:D$41,$AE19),\"xx\")","v":"xx"},{"$f":"IF(C56=\"Ja\",INDEX(Grundkarakterer!E$8:E$41,$AE19),\"xx\")","v":"xx"},{"$f":"IF($C56=\"Ja\",INDEX(Grundkarakterer!F$8:F$41,$AE19),\"xx\")","v":"xx"},{"$f":"IF($C56=\"Ja\",INDEX(Grundkarakterer!H$8:H$41,$AE19),\"xx\")","v":"xx"},{"$f":"IF($C56=\"Ja\",INDEX(Grundkarakterer!I$8:I$41,$AE19),\"xx\")","v":"xx"},{"$f":"IF($C56=\"Ja\",INDEX(Grundkarakterer!J$8:J$41,$AE19),\"xx\")","v":"xx"},{"$f":"IF($C56=\"Ja\",INDEX(Grundkarakterer!K$8:K$41,$AE19),\"xx\")","v":"xx"},{"$f":"IF($C56=\"Ja\",INDEX(Grundkarakterer!L$8:L$41,$AE19),\"xx\")","v":"xx"},{"$f":"IF($C56=\"Ja\",INDEX(Grundkarakterer!M$8:M$41,$AE19),\"xx\")","v":"xx"},{"$f":"IF($C56=\"Ja\",INDEX(Grundkarakterer!N$8:N$41,$AE19),\"xx\")","v":"xx"},{"$f":"IF($C56=\"Ja\",INDEX(Grundkarakterer!O$8:O$41,$AE19),\"xx\")","v":"xx"},{"$f":"IF($C56=\"Ja\",INDEX(Grundkarakterer!P$8:P$41,$AE19),\"xx\")","v":"xx"},{"$f":"IF($C56=\"Ja\",INDEX(Grundkarakterer!Q$8:Q$41,$AE19),\"xx\")","v":"xx"},{"$f":"IF($C56=\"Ja\",INDEX(Grundkarakterer!R$8:R$41,$AE19),\"xx\")","v":"xx"},{"$f":"IF($C56=\"Ja\",INDEX(Grundkarakterer!S$8:S$41,$AE19),\"xx\")","v":"xx"},{"$f":"IF($C56=\"Ja\",INDEX(Grundkarakterer!T$8:T$41,$AE19),\"xx\")","v":"xx"},{"$f":"IF($C56=\"Ja\",INDEX(Grundkarakterer!U$8:U$41,$AE19),\"xx\")","v":"xx"},{"$f":"IF($C56=\"Ja\",INDEX(Grundkarakterer!V$8:V$41,$AE19),\"xx\")","v":"xx"},{"$f":"IF($C56=\"Ja\",INDEX(Grundkarakterer!W$8:W$41,$AE19),\"xx\")","v":"xx"},{"$f":"IF($C56=\"Ja\",INDEX(Grundkarakterer!X$8:X$41,$AE19),\"xx\")","v":"xx"},{"$f":"IF($C56=\"Ja\",INDEX(Grundkarakterer!Y$8:Y$41,$AE19),\"xx\")","v":"xx"},{"$f":"IF($C56=\"Ja\",INDEX(Grundkarakterer!Z$8:Z$41,$AE19),\"xx\")","v":"xx"},{"$f":"IF($C56=\"Ja\",INDEX(Grundkarakterer!AA$8:AA$41,$AE19),\"xx\")","v":"xx"},{"$f":"IF($C56=\"Ja\",INDEX(Grundkarakterer!AB$8:AB$41,$AE19),\"xx\")","v":"xx"},{"$f":"IF($C56=\"Ja\",INDEX(Grundkarakterer!AC$8:AC$41,$AE19),\"xx\")","v":"xx"},{"$f":"IF($C56=\"Ja\",INDEX(Grundkarakterer!G$8:G$41,$AE19),\"xx\")","v":"xx"}]
[18,{"$f":"INDEX(Grundkarakterer!A$8:A$41,AE20)","v":18},"Nej",{"$f":"IF(C57=\"Ja\",INDEX(Grundkarakterer!B$8:B$41,AE20),\"xx\")","v":"xx"},{"$f":"IF(C57=\"Ja\",INDEX(Grundkarakterer!C$8:C$41,$AE20),\"xx\")","v":"xx"},{"$f":"IF(C57=\"Ja\",INDEX(Grundkarakterer!D$8:D$41,$AE20),\"xx\")","v":"xx"},{"$f":"IF(C57=\"Ja\",INDEX(Grundkarakterer!E$8:E$41,$AE20),\"xx\")","v":"xx"},{"$f":"IF($C57=\"Ja\",INDEX(Grundkarakterer!F$8:F$41,$AE20),\"xx\")","v":"xx"},{"$f":"IF($C57=\"Ja\",INDEX(Grundkarakterer!H$8:H$41,$AE20),\"xx\")","v":"xx"},{"$f":"IF($C57=\"Ja\",INDEX(Grundkarakterer!I$8:I$41,$AE20),\"xx\")","v":"xx"},{"$f":"IF($C57=\"Ja\",INDEX(Grundkarakterer!J$8:J$41,$AE20),\"xx\")","v":"xx"},{"$f":"IF($C57=\"Ja\",INDEX(Grundkarakterer!K$8:K$41,$AE20),\"xx\")","v":"xx"},{"$f":"IF($C57=\"Ja\",INDEX(Grundkarakterer!L$8:L$41,$AE20),\"xx\")","v":"xx"},{"$f":"IF($C57=\"Ja\",INDEX(Grundkarakterer!M$8:M$41,$AE20),\"xx\")","v":"xx"},{"$f":"IF($C57=\"Ja\",INDEX(Grundkarakterer!N$8:N$41,$AE20),\"xx\")","v":"xx"},{"$f":"IF($C57=\"Ja\",INDEX(Grundkarakterer!O$8:O$41,$AE20),\"xx\")","v":"xx"},{"$f":"IF($C57=\"Ja\",INDEX(Grundkarakterer!P$8:P$41,$AE20),\"xx\")","v":"xx"},{"$f":"IF($C57=\"Ja\",INDEX(Grundkarakterer!Q$8:Q$41,$AE20),\"xx\")","v":"xx"},{"$f":"IF($C57=\"Ja\",INDEX(Grundkarakterer!R$8:R$41,$AE20),\"xx\")","v":"xx"},{"$f":"IF($C57=\"Ja\",INDEX(Grundkarakterer!S$8:S$41,$AE20),\"xx\")","v":"xx"},{"$f":"IF($C57=\"Ja\",INDEX(Grundkarakterer!T$8:T$41,$AE20),\"xx\")","v":"xx"},{"$f":"IF($C57=\"Ja\",INDEX(Grundkarakterer!U$8:U$41,$AE20),\"xx\")","v":"xx"},{"$f":"IF($C57=\"Ja\",INDEX(Grundkarakterer!V$8:V$41,$AE20),\"xx\")","v":"xx"},{"$f":"IF($C57=\"Ja\",INDEX(Grundkarakterer!W$8:W$41,$AE20),\"xx\")","v":"xx"},{"$f":"IF($C57=\"Ja\",INDEX(Grundkarakterer!X$8:X$41,$AE20),\"xx\")","v":"xx"},{"$f":"IF($C57=\"Ja\",INDEX(Grundkarakterer!Y$8:Y$41,$AE20),\"xx\")","v":"xx"},{"$f":"IF($C57=\"Ja\",INDEX(Grundkarakterer!Z$8:Z$41,$AE20),\"xx\")","v":"xx"},{"$f":"IF($C57=\"Ja\",INDEX(Grundkarakterer!AA$8:AA$41,$AE20),\"xx\")","v":"xx"},{"$f":"IF($C57=\"Ja\",INDEX(Grundkarakterer!AB$8:AB$41,$AE20),\"xx\")","v":"xx"},{"$f":"IF($C57=\"Ja\",INDEX(Grundkarakterer!AC$8:AC$41,$AE20),\"xx\")","v":"xx"},{"$f":"IF($C57=\"Ja\",INDEX(Grundkarakterer!G$8:G$41,$AE20),\"xx\")","v":"xx"}]
[19,{"$f":"INDEX(Grundkarakterer!A$8:A$41,AE21)","v":19},"Nej",{"$f":"IF(C58=\"Ja\",INDEX(Grundkarakterer!B$8:B$41,AE21),\"xx\")","v":"xx"},{"$f":"IF(C58=\"Ja\",INDEX(Grundkarakterer!C$8:C$41,$AE21),\"xx\")","v":"xx"},{"$f":"IF(C58=\"Ja\",INDEX(Grundkarakterer!D$8:D$41,$AE21),\"xx\")","v":"xx"},{"$f":"IF(C58=\"Ja\",INDEX(Grundkarakterer!E$8:E$41,$AE21),\"xx\")","v":"xx"},{"$f":"IF($C58=\"Ja\",INDEX(Grundkarakterer!F$8:F$41,$AE21),\"xx\")","v":"xx"},{"$f":"IF($C58=\"Ja\",INDEX(Grundkarakterer!H$8:H$41,$AE21),\"xx\")","v":"xx"},{"$f":"IF($C58=\"Ja\",INDEX(Grundkarakterer!I$8:I$41,$AE21),\"xx\")","v":"xx"},{"$f":"IF($C58=\"Ja\",INDEX(Grundkarakterer!J$8:J$41,$AE21),\"xx\")","v":"xx"},{"$f":"IF($C58=\"Ja\",INDEX(Grundkarakterer!K$8:K$41,$AE21),\"xx\")","v":"xx"},{"$f":"IF($C58=\"Ja\",INDEX(Grundkarakterer!L$8:L$41,$AE21),\"xx\")","v":"xx"},{"$f":"IF($C58=\"Ja\",INDEX(Grundkarakterer!M$8:M$41,$AE21),\"xx\")","v":"xx"},{"$f":"IF($C58=\"Ja\",INDEX(Grundkarakterer!N$8:N$41,$AE21),\"xx\")","v":"xx"},{"$f":"IF($C58=\"Ja\",INDEX(Grundkarakterer!O$8:O$41,$AE21),\"xx\")","v":"xx"},{"$f":"IF($C58=\"Ja\",INDEX(Grundkarakterer!P$8:P$41,$AE21),\"xx\")","v":"xx"},{"$f":"IF($C58=\"Ja\",INDEX(Grundkarakterer!Q$8:Q$41,$AE21),\"xx\")","v":"xx"},{"$f":"IF($C58=\"Ja\",INDEX(Grundkarakterer!R$8:R$41,$AE21),\"xx\")","v":"xx"},{"$f":"IF($C58=\"Ja\",INDEX(Grundkarakterer!S$8:S$41,$AE21),\"xx\")","v":"xx"},{"$f":"IF($C58=\"Ja\",INDEX(Grundkarakterer!T$8:T$41,$AE21),\"xx\")","v":"xx"},{"$f":"IF($C58=\"Ja\",INDEX(Grundkarakterer!U$8:U$41,$AE21),\"xx\")","v":"xx"},{"$f":"IF($C58=\"Ja\",INDEX(Grundkarakterer!V$8:V$41,$AE21),\"xx\")","v":"xx"},{"$f":"IF($C58=\"Ja\",INDEX(Grundkarakterer!W$8:W$41,$AE21),\"xx\")","v":"xx"},{"$f":"IF($C58=\"Ja\",INDEX(Grundkarakterer!X$8:X$41,$AE21),\"xx\")","v":"xx"},{"$f":"IF($C58=\"Ja\",INDEX(Grundkarakterer!Y$8:Y$41,$AE21),\"xx\")","v":"xx"},{"$f":"IF($C58=\"Ja\",INDEX(Grundkarakterer!Z$8:Z$41,$AE21),\"xx\")","v":"xx"},{"$f":"IF($C58=\"Ja\",INDEX(Grundkarakterer!AA$8:AA$41,$AE21),\"xx\")","v":"xx"},{"$f":"IF($C58=\"Ja\",INDEX(Grundkarakterer!AB$8:AB$41,$AE21),\"xx\")","v":"xx"},{"$f":"IF($C58=\"Ja\",INDEX(Grundkarakterer!AC$8:AC$41,$AE21),\"xx\")","v":"xx"},{"$f":"IF($C58=\"Ja\",INDEX(Grundkarakterer!G$8:G$41,$AE21),\"xx\")","v":"xx"}]
[20,{"$f":"INDEX(Grundkarakterer!A$8:A$41,AE22)","v":20},"Nej",{"$f":"IF(C59=\"Ja\",INDEX(Grundkarakterer!B$8:B$41,AE22),\"xx\")","v":"xx"},{"$f":"IF(C59=\"Ja\",INDEX(Grundkarakterer!C$8:C$41,$AE22),\"xx\")","v":"xx"},{"$f":"IF(C59=\"Ja\",INDEX(Grundkarakterer!D$8:D$41,$AE22),\"xx\")","v":"xx"},{"$f":"IF(C59=\"Ja\",INDEX(Grundkarakterer!E$8:E$41,$AE22),\"xx\")","v":"xx"},{"$f":"IF($C59=\"Ja\",INDEX(Grundkarakterer!F$8:F$41,$AE22),\"xx\")","v":"xx"},{"$f":"IF($C59=\"Ja\",INDEX(Grundkarakterer!H$8:H$41,$AE22),\"xx\")","v":"xx"},{"$f":"IF($C59=\"Ja\",INDEX(Grundkarakterer!I$8:I$41,$AE22),\"xx\")","v":"xx"},{"$f":"IF($C59=\"Ja\",INDEX(Grundkarakterer!J$8:J$41,$AE22),\"xx\")","v":"xx"},{"$f":"IF($C59=\"Ja\",INDEX(Grundkarakterer!K$8:K$41,$AE22),\"xx\")","v":"xx"},{"$f":"IF($C59=\"Ja\",INDEX(Grundkarakterer!L$8:L$41,$AE22),\"xx\")","v":"xx"},{"$f":"IF($C59=\"Ja\",INDEX(Grundkarakterer!M$8:M$41,$AE22),\"xx\")","v":"xx"},{"$f":"IF($C59=\"Ja\",INDEX(Grundkarakterer!N$8:N$41,$AE22),\"xx\")","v":"xx"},{"$f":"IF($C59=\"Ja\",INDEX(Grundkarakterer!O$8:O$41,$AE22),\"xx\")","v":"xx"},{"$f":"IF($C59=\"Ja\",INDEX(Grundkarakterer!P$8:P$41,$AE22),\"xx\")","v":"xx"},{"$f":"IF($C59=\"Ja\",INDEX(Grundkarakterer!Q$8:Q$41,$AE22),\"xx\")","v":"xx"},{"$f":"IF($C59=\"Ja\",INDEX(Grundkarakterer!R$8:R$41,$AE22),\"xx\")","v":"xx"},{"$f":"IF($C59=\"Ja\",INDEX(Grundkarakterer!S$8:S$41,$AE22),\"xx\")","v":"xx"},{"$f":"IF($C59=\"Ja\",INDEX(Grundkarakterer!T$8:T$41,$AE22),\"xx\")","v":"xx"},{"$f":"IF($C59=\"Ja\",INDEX(Grundkarakterer!U$8:U$41,$AE22),\"xx\")","v":"xx"},{"$f":"IF($C59=\"Ja\",INDEX(Grundkarakterer!V$8:V$41,$AE22),\"xx\")","v":"xx"},{"$f":"IF($C59=\"Ja\",INDEX(Grundkarakterer!W$8:W$41,$AE22),\"xx\")","v":"xx"},{"$f":"IF($C59=\"Ja\",INDEX(Grundkarakterer!X$8:X$41,$AE22),\"xx\")","v":"xx"},{"$f":"IF($C59=\"Ja\",INDEX(Grundkarakterer!Y$8:Y$41,$AE22),\"xx\")","v":"xx"},{"$f":"IF($C59=\"Ja\",INDEX(Grundkarakterer!Z$8:Z$41,$AE22),\"xx\")","v":"xx"},{"$f":"IF($C59=\"Ja\",INDEX(Grundkarakterer!AA$8:AA$41,$AE22),\"xx\")","v":"xx"},{"$f":"IF($C59=\"Ja\",INDEX(Grundkarakterer!AB$8:AB$41,$AE22),\"xx\")","v":"xx"},{"$f":"IF($C59=\"Ja\",INDEX(Grundkarakterer!AC$8:AC$41,$AE22),\"xx\")","v":"xx"},{"$f":"IF($C59=\"Ja\",INDEX(Grundkarakterer!G$8:G$41,$AE22),\"xx\")","v":"xx"}]
[21,{"$f":"INDEX(Grundkarakterer!A$8:A$41,AE23)","v":21},"Nej",{"$f":"IF(C60=\"Ja\",INDEX(Grundkarakterer!B$8:B$41,AE23),\"xx\")","v":"xx"},{"$f":"IF(C60=\"Ja\",INDEX(Grundkarakterer!C$8:C$41,$AE23),\"xx\")","v":"xx"},{"$f":"IF(C60=\"Ja\",INDEX(Grundkarakterer!D$8:D$41,$AE23),\"xx\")","v":"xx"},{"$f":"IF(C60=\"Ja\",INDEX(Grundkarakterer!E$8:E$41,$AE23),\"xx\")","v":"xx"},{"$f":"IF($C60=\"Ja\",INDEX(Grundkarakterer!F$8:F$41,$AE23),\"xx\")","v":"xx"},{"$f":"IF($C60=\"Ja\",INDEX(Grundkarakterer!H$8:H$41,$AE23),\"xx\")","v":"xx"},{"$f":"IF($C60=\"Ja\",INDEX(Grundkarakterer!I$8:I$41,$AE23),\"xx\")","v":"xx"},{"$f":"IF($C60=\"Ja\",INDEX(Grundkarakterer!J$8:J$41,$AE23),\"xx\")","v":"xx"},{"$f":"IF($C60=\"Ja\",INDEX(Grundkarakterer!K$8:K$41,$AE23),\"xx\")","v":"xx"},{"$f":"IF($C60=\"Ja\",INDEX(Grundkarakterer!L$8:L$41,$AE23),\"xx\")","v":"xx"},{"$f":"IF($C60=\"Ja\",INDEX(Grundkarakterer!M$8:M$41,$AE23),\"xx\")","v":"xx"},{"$f":"IF($C60=\"Ja\",INDEX(Grundkarakterer!N$8:N$41,$AE23),\"xx\")","v":"xx"},{"$f":"IF($C60=\"Ja\",INDEX(Grundkarakterer!O$8:O$41,$AE23),\"xx\")","v":"xx"},{"$f":"IF($C60=\"Ja\",INDEX(Grundkarakterer!P$8:P$41,$AE23),\"xx\")","v":"xx"},{"$f":"IF($C60=\"Ja\",INDEX(Grundkarakterer!Q$8:Q$41,$AE23),\"xx\")","v":"xx"},{"$f":"IF($C60=\"Ja\",INDEX(Grundkarakterer!R$8:R$41,$AE23),\"xx\")","v":"xx"},{"$f":"IF($C60=\"Ja\",INDEX(Grundkarakterer!S$8:S$41,$AE23),\"xx\")","v":"xx"},{"$f":"IF($C60=\"Ja\",INDEX(Grundkarakterer!T$8:T$41,$AE23),\"xx\")","v":"xx"},{"$f":"IF($C60=\"Ja\",INDEX(Grundkarakterer!U$8:U$41,$AE23),\"xx\")","v":"xx"},{"$f":"IF($C60=\"Ja\",INDEX(Grundkarakterer!V$8:V$41,$AE23),\"xx\")","v":"xx"},{"$f":"IF($C60=\"Ja\",INDEX(Grundkarakterer!W$8:W$41,$AE23),\"xx\")","v":"xx"},{"$f":"IF($C60=\"Ja\",INDEX(Grundkarakterer!X$8:X$41,$AE23),\"xx\")","v":"xx"},{"$f":"IF($C60=\"Ja\",INDEX(Grundkarakterer!Y$8:Y$41,$AE23),\"xx\")","v":"xx"},{"$f":"IF($C60=\"Ja\",INDEX(Grundkarakterer!Z$8:Z$41,$AE23),\"xx\")","v":"xx"},{"$f":"IF($C60=\"Ja\",INDEX(Grundkarakterer!AA$8:AA$41,$AE23),\"xx\")","v":"xx"},{"$f":"IF($C60=\"Ja\",INDEX(Grundkarakterer!AB$8:AB$41,$AE23),\"xx\")","v":"xx"},{"$f":"IF($C60=\"Ja\",INDEX(Grundkarakterer!AC$8:AC$41,$AE23),\"xx\")","v":"xx"},{"$f":"IF($C60=\"Ja\",INDEX(Grundkarakterer!G$8:G$41,$AE23),\"xx\")","v":"xx"}]
[22,{"$f":"INDEX(Grundkarakterer!A$8:A$41,AE24)","v":22},"Nej",{"$f":"IF(C61=\"Ja\",INDEX(Grundkarakterer!B$8:B$41,AE24),\"xx\")","v":"xx"},{"$f":"IF(C61=\"Ja\",INDEX(Grundkarakterer!C$8:C$41,$AE24),\"xx\")","v":"xx"},{"$f":"IF(C61=\"Ja\",INDEX(Grundkarakterer!D$8:D$41,$AE24),\"xx\")","v":"xx"},{"$f":"IF(C61=\"Ja\",INDEX(Grundkarakterer!E$8:E$41,$AE24),\"xx\")","v":"xx"},{"$f":"IF($C61=\"Ja\",INDEX(Grundkarakterer!F$8:F$41,$AE24),\"xx\")","v":"xx"},{"$f":"IF($C61=\"Ja\",INDEX(Grundkarakterer!H$8:H$41,$AE24),\"xx\")","v":"xx"},{"$f":"IF($C61=\"Ja\",INDEX(Grundkarakterer!I$8:I$41,$AE24),\"xx\")","v":"xx"},{"$f":"IF($C61=\"Ja\",INDEX(Grundkarakterer!J$8:J$41,$AE24),\"xx\")","v":"xx"},{"$f":"IF($C61=\"Ja\",INDEX(Grundkarakterer!K$8:K$41,$AE24),\"xx\")","v":"xx"},{"$f":"IF($C61=\"Ja\",INDEX(Grundkarakterer!L$8:L$41,$AE24),\"xx\")","v":"xx"},{"$f":"IF($C61=\"Ja\",INDEX(Grundkarakterer!M$8:M$41,$AE24),\"xx\")","v":"xx"},{"$f":"IF($C61=\"Ja\",INDEX(Grundkarakterer!N$8:N$41,$AE24),\"xx\")","v":"xx"},{"$f":"IF($C61=\"Ja\",INDEX(Grundkarakterer!O$8:O$41,$AE24),\"xx\")","v":"xx"},{"$f":"IF($C61=\"Ja\",INDEX(Grundkarakterer!P$8:P$41,$AE24),\"xx\")","v":"xx"},{"$f":"IF($C61=\"Ja\",INDEX(Grundkarakterer!Q$8:Q$41,$AE24),\"xx\")","v":"xx"},{"$f":"IF($C61=\"Ja\",INDEX(Grundkarakterer!R$8:R$41,$AE24),\"xx\")","v":"xx"},{"$f":"IF($C61=\"Ja\",INDEX(Grundkarakterer!S$8:S$41,$AE24),\"xx\")","v":"xx"},{"$f":"IF($C61=\"Ja\",INDEX(Grundkarakterer!T$8:T$41,$AE24),\"xx\")","v":"xx"},{"$f":"IF($C61=\"Ja\",INDEX(Grundkarakterer!U$8:U$41,$AE24),\"xx\")","v":"xx"},{"$f":"IF($C61=\"Ja\",INDEX(Grundkarakterer!V$8:V$41,$AE24),\"xx\")","v":"xx"},{"$f":"IF($C61=\"Ja\",INDEX(Grundkarakterer!W$8:W$41,$AE24),\"xx\")","v":"xx"},{"$f":"IF($C61=\"Ja\",INDEX(Grundkarakterer!X$8:X$41,$AE24),\"xx\")","v":"xx"},{"$f":"IF($C61=\"Ja\",INDEX(Grundkarakterer!Y$8:Y$41,$AE24),\"xx\")","v":"xx"},{"$f":"IF($C61=\"Ja\",INDEX(Grundkarakterer!Z$8:Z$41,$AE24),\"xx\")","v":"xx"},{"$f":"IF($C61=\"Ja\",INDEX(Grundkarakterer!AA$8:AA$41,$AE24),\"xx\")","v":"xx"},{"$f":"IF($C61=\"Ja\",INDEX(Grundkarakterer!AB$8:AB$41,$AE24),\"xx\")","v":"xx"},{"$f":"IF($C61=\"Ja\",INDEX(Grundkarakterer!AC$8:AC$41,$AE24),\"xx\")","v":"xx"},{"$f":"IF($C61=\"Ja\",INDEX(Grundkarakterer!G$8:G$41,$AE24),\"xx\")","v":"xx"}]
[23,{"$f":"INDEX(Grundkarakterer!A$8:A$41,AE25)","v":23},"Nej",{"$f":"IF(C62=\"Ja\",INDEX(Grundkarakterer!B$8:B$41,AE25),\"xx\")","v":"xx"},{"$f":"IF(C62=\"Ja\",INDEX(Grundkarakterer!C$8:C$41,$AE25),\"xx\")","v":"xx"},{"$f":"IF(C62=\"Ja\",INDEX(Grundkarakterer!D$8:D$41,$AE25),\"xx\")","v":"xx"},{"$f":"IF(C62=\"Ja\",INDEX(Grundkarakterer!E$8:E$41,$AE25),\"xx\")","v":"xx"},{"$f":"IF($C62=\"Ja\",INDEX(Grundkarakterer!F$8:F$41,$AE25),\"xx\")","v":"xx"},{"$f":"IF($C62=\"Ja\",INDEX(Grundkarakterer!H$8:H$41,$AE25),\"xx\")","v":"xx"},{"$f":"IF($C62=\"Ja\",INDEX(Grundkarakterer!I$8:I$41,$AE25),\"xx\")","v":"xx"},{"$f":"IF($C62=\"Ja\",INDEX(Grundkarakterer!J$8:J$41,$AE25),\"xx\")","v":"xx"},{"$f":"IF($C62=\"Ja\",INDEX(Grundkarakterer!K$8:K$41,$AE25),\"xx\")","v":"xx"},{"$f":"IF($C62=\"Ja\",INDEX(Grundkarakterer!L$8:L$41,$AE25),\"xx\")","v":"xx"},{"$f":"IF($C62=\"Ja\",INDEX(Grundkarakterer!M$8:M$41,$AE25),\"xx\")","v":"xx"},{"$f":"IF($C62=\"Ja\",INDEX(Grundkarakterer!N$8:N$41,$AE25),\"xx\")","v":"xx"},{"$f":"IF($C62=\"Ja\",INDEX(Grundkarakterer!O$8:O$41,$AE25),\"xx\")","v":"xx"},{"$f":"IF($C62=\"Ja\",INDEX(Grundkarakterer!P$8:P$41,$AE25),\"xx\")","v":"xx"},{"$f":"IF($C62=\"Ja\",INDEX(Grundkarakterer!Q$8:Q$41,$AE25),\"xx\")","v":"xx"},{"$f":"IF($C62=\"Ja\",INDEX(Grundkarakterer!R$8:R$41,$AE25),\"xx\")","v":"xx"},{"$f":"IF($C62=\"Ja\",INDEX(Grundkarakterer!S$8:S$41,$AE25),\"xx\")","v":"xx"},{"$f":"IF($C62=\"Ja\",INDEX(Grundkarakterer!T$8:T$41,$AE25),\"xx\")","v":"xx"},{"$f":"IF($C62=\"Ja\",INDEX(Grundkarakterer!U$8:U$41,$AE25),\"xx\")","v":"xx"},{"$f":"IF($C62=\"Ja\",INDEX(Grundkarakterer!V$8:V$41,$AE25),\"xx\")","v":"xx"},{"$f":"IF($C62=\"Ja\",INDEX(Grundkarakterer!W$8:W$41,$AE25),\"xx\")","v":"xx"},{"$f":"IF($C62=\"Ja\",INDEX(Grundkarakterer!X$8:X$41,$AE25),\"xx\")","v":"xx"},{"$f":"IF($C62=\"Ja\",INDEX(Grundkarakterer!Y$8:Y$41,$AE25),\"xx\")","v":"xx"},{"$f":"IF($C62=\"Ja\",INDEX(Grundkarakterer!Z$8:Z$41,$AE25),\"xx\")","v":"xx"},{"$f":"IF($C62=\"Ja\",INDEX(Grundkarakterer!AA$8:AA$41,$AE25),\"xx\")","v":"xx"},{"$f":"IF($C62=\"Ja\",INDEX(Grundkarakterer!AB$8:AB$41,$AE25),\"xx\")","v":"xx"},{"$f":"IF($C62=\"Ja\",INDEX(Grundkarakterer!AC$8:AC$41,$AE25),\"xx\")","v":"xx"},{"$f":"IF($C62=\"Ja\",INDEX(Grundkarakterer!G$8:G$41,$AE25),\"xx\")","v":"xx"}]
[24,{"$f":"INDEX(Grundkarakterer!A$8:A$41,AE26)","v":24},"Nej",{"$f":"IF(C63=\"Ja\",INDEX(Grundkarakterer!B$8:B$41,AE26),\"xx\")","v":"xx"},{"$f":"IF(C63=\"Ja\",INDEX(Grundkarakterer!C$8:C$41,$AE26),\"xx\")","v":"xx"},{"$f":"IF(C63=\"Ja\",INDEX(Grundkarakterer!D$8:D$41,$AE26),\"xx\")","v":"xx"},{"$f":"IF(C63=\"Ja\",INDEX(Grundkarakterer!E$8:E$41,$AE26),\"xx\")","v":"xx"},{"$f":"IF($C63=\"Ja\",INDEX(Grundkarakterer!F$8:F$41,$AE26),\"xx\")","v":"xx"},{"$f":"IF($C63=\"Ja\",INDEX(Grundkarakterer!H$8:H$41,$AE26),\"xx\")","v":"xx"},{"$f":"IF($C63=\"Ja\",INDEX(Grundkarakterer!I$8:I$41,$AE26),\"xx\")","v":"xx"},{"$f":"IF($C63=\"Ja\",INDEX(Grundkarakterer!J$8:J$41,$AE26),\"xx\")","v":"xx"},{"$f":"IF($C63=\"Ja\",INDEX(Grundkarakterer!K$8:K$41,$AE26),\"xx\")","v":"xx"},{"$f":"IF($C63=\"Ja\",INDEX(Grundkarakterer!L$8:L$41,$AE26),\"xx\")","v":"xx"},{"$f":"IF($C63=\"Ja\",INDEX(Grundkarakterer!M$8:M$41,$AE26),\"xx\")","v":"xx"},{"$f":"IF($C63=\"Ja\",INDEX(Grundkarakterer!N$8:N$41,$AE26),\"xx\")","v":"xx"},{"$f":"IF($C63=\"Ja\",INDEX(Grundkarakterer!O$8:O$41,$AE26),\"xx\")","v":"xx"},{"$f":"IF($C63=\"Ja\",INDEX(Grundkarakterer!P$8:P$41,$AE26),\"xx\")","v":"xx"},{"$f":"IF($C63=\"Ja\",INDEX(Grundkarakterer!Q$8:Q$41,$AE26),\"xx\")","v":"xx"},{"$f":"IF($C63=\"Ja\",INDEX(Grundkarakterer!R$8:R$41,$AE26),\"xx\")","v":"xx"},{"$f":"IF($C63=\"Ja\",INDEX(Grundkarakterer!S$8:S$41,$AE26),\"xx\")","v":"xx"},{"$f":"IF($C63=\"Ja\",INDEX(Grundkarakterer!T$8:T$41,$AE26),\"xx\")","v":"xx"},{"$f":"IF($C63=\"Ja\",INDEX(Grundkarakterer!U$8:U$41,$AE26),\"xx\")","v":"xx"},{"$f":"IF($C63=\"Ja\",INDEX(Grundkarakterer!V$8:V$41,$AE26),\"xx\")","v":"xx"},{"$f":"IF($C63=\"Ja\",INDEX(Grundkarakterer!W$8:W$41,$AE26),\"xx\")","v":"xx"},{"$f":"IF($C63=\"Ja\",INDEX(Grundkarakterer!X$8:X$41,$AE26),\"xx\")","v":"xx"},{"$f":"IF($C63=\"Ja\",INDEX(Grundkarakterer!Y$8:Y$41,$AE26),\"xx\")","v":"xx"},{"$f":"IF($C63=\"Ja\",INDEX(Grundkarakterer!Z$8:Z$41,$AE26),\"xx\")","v":"xx"},{"$f":"IF($C63=\"Ja\",INDEX(Grundkarakterer!AA$8:AA$41,$AE26),\"xx\")","v":"xx"},{"$f":"IF($C63=\"Ja\",INDEX(Grundkarakterer!AB$8:AB$41,$AE26),\"xx\")","v":"xx"},{"$f":"IF($C63=\"Ja\",INDEX(Grundkarakterer!AC$8:AC$41,$AE26),\"xx\")","v":"xx"},{"$f":"IF($C63=\"Ja\",INDEX(Grundkarakterer!G$8:G$41,$AE26),\"xx\")","v":"xx"}]
[25,{"$f":"INDEX(Grundkarakterer!A$8:A$41,AE27)","v":25},"Nej",{"$f":"IF(C64=\"Ja\",INDEX(Grundkarakterer!B$8:B$41,AE27),\"xx\")","v":"xx"},{"$f":"IF(C64=\"Ja\",INDEX(Grundkarakterer!C$8:C$41,$AE27),\"xx\")","v":"xx"},{"$f":"IF(C64=\"Ja\",INDEX(Grundkarakterer!D$8:D$41,$AE27),\"xx\")","v":"xx"},{"$f":"IF(C64=\"Ja\",INDEX(Grundkarakterer!E$8:E$41,$AE27),\"xx\")","v":"xx"},{"$f":"IF($C64=\"Ja\",INDEX(Grundkarakterer!F$8:F$41,$AE27),\"xx\")","v":"xx"},{"$f":"IF($C64=\"Ja\",INDEX(Grundkarakterer!H$8:H$41,$AE27),\"xx\")","v":"xx"},{"$f":"IF($C64=\"Ja\",INDEX(Grundkarakterer!I$8:I$41,$AE27),\"xx\")","v":"xx"},{"$f":"IF($C64=\"Ja\",INDEX(Grundkarakterer!J$8:J$41,$AE27),\"xx\")","v":"xx"},{"$f":"IF($C64=\"Ja\",INDEX(Grundkarakterer!K$8:K$41,$AE27),\"xx\")","v":"xx"},{"$f":"IF($C64=\"Ja\",INDEX(Grundkarakterer!L$8:L$41,$AE27),\"xx\")","v":"xx"},{"$f":"IF($C64=\"Ja\",INDEX(Grundkarakterer!M$8:M$41,$AE27),\"xx\")","v":"xx"},{"$f":"IF($C64=\"Ja\",INDEX(Grundkarakterer!N$8:N$41,$AE27),\"xx\")","v":"xx"},{"$f":"IF($C64=\"Ja\",INDEX(Grundkarakterer!O$8:O$41,$AE27),\"xx\")","v":"xx"},{"$f":"IF($C64=\"Ja\",INDEX(Grundkarakterer!P$8:P$41,$AE27),\"xx\")","v":"xx"},{"$f":"IF($C64=\"Ja\",INDEX(Grundkarakterer!Q$8:Q$41,$AE27),\"xx\")","v":"xx"},{"$f":"IF($C64=\"Ja\",INDEX(Grundkarakterer!R$8:R$41,$AE27),\"xx\")","v":"xx"},{"$f":"IF($C64=\"Ja\",INDEX(Grundkarakterer!S$8:S$41,$AE27),\"xx\")","v":"xx"},{"$f":"IF($C64=\"Ja\",INDEX(Grundkarakterer!T$8:T$41,$AE27),\"xx\")","v":"xx"},{"$f":"IF($C64=\"Ja\",INDEX(Grundkarakterer!U$8:U$41,$AE27),\"xx\")","v":"xx"},{"$f":"IF($C64=\"Ja\",INDEX(Grundkarakterer!V$8:V$41,$AE27),\"xx\")","v":"xx"},{"$f":"IF($C64=\"Ja\",INDEX(Grundkarakterer!W$8:W$41,$AE27),\"xx\")","v":"xx"},{"$f":"IF($C64=\"Ja\",INDEX(Grundkarakterer!X$8:X$41,$AE27),\"xx\")","v":"xx"},{"$f":"IF($C64=\"Ja\",INDEX(Grundkarakterer!Y$8:Y$41,$AE27),\"xx\")","v":"xx"},{"$f":"IF($C64=\"Ja\",INDEX(Grundkarakterer!Z$8:Z$41,$AE27),\"xx\")","v":"xx"},{"$f":"IF($C64=\"Ja\",INDEX(Grundkarakterer!AA$8:AA$41,$AE27),\"xx\")","v":"xx"},{"$f":"IF($C64=\"Ja\",INDEX(Grundkarakterer!AB$8:AB$41,$AE27),\"xx\")","v":"xx"},{"$f":"IF($C64=\"Ja\",INDEX(Grundkarakterer!AC$8:AC$41,$AE27),\"xx\")","v":"xx"},{"$f":"IF($C64=\"Ja\",INDEX(Grundkarakterer!G$8:G$41,$AE27),\"xx\")","v":"xx"}]
[26,{"$f":"INDEX(Grundkarakterer!A$8:A$41,AE28)","v":26},"Nej",{"$f":"IF(C65=\"Ja\",INDEX(Grundkarakterer!B$8:B$41,AE28),\"xx\")","v":"xx"},{"$f":"IF(C65=\"Ja\",INDEX(Grundkarakterer!C$8:C$41,$AE28),\"xx\")","v":"xx"},{"$f":"IF(C65=\"Ja\",INDEX(Grundkarakterer!D$8:D$41,$AE28),\"xx\")","v":"xx"},{"$f":"IF(C65=\"Ja\",INDEX(Grundkarakterer!E$8:E$41,$AE28),\"xx\")","v":"xx"},{"$f":"IF($C65=\"Ja\",INDEX(Grundkarakterer!F$8:F$41,$AE28),\"xx\")","v":"xx"},{"$f":"IF($C65=\"Ja\",INDEX(Grundkarakterer!H$8:H$41,$AE28),\"xx\")","v":"xx"},{"$f":"IF($C65=\"Ja\",INDEX(Grundkarakterer!I$8:I$41,$AE28),\"xx\")","v":"xx"},{"$f":"IF($C65=\"Ja\",INDEX(Grundkarakterer!J$8:J$41,$AE28),\"xx\")","v":"xx"},{"$f":"IF($C65=\"Ja\",INDEX(Grundkarakterer!K$8:K$41,$AE28),\"xx\")","v":"xx"},{"$f":"IF($C65=\"Ja\",INDEX(Grundkarakterer!L$8:L$41,$AE28),\"xx\")","v":"xx"},{"$f":"IF($C65=\"Ja\",INDEX(Grundkarakterer!M$8:M$41,$AE28),\"xx\")","v":"xx"},{"$f":"IF($C65=\"Ja\",INDEX(Grundkarakterer!N$8:N$41,$AE28),\"xx\")","v":"xx"},{"$f":"IF($C65=\"Ja\",INDEX(Grundkarakterer!O$8:O$41,$AE28),\"xx\")","v":"xx"},{"$f":"IF($C65=\"Ja\",INDEX(Grundkarakterer!P$8:P$41,$AE28),\"xx\")","v":"xx"},{"$f":"IF($C65=\"Ja\",INDEX(Grundkarakterer!Q$8:Q$41,$AE28),\"xx\")","v":"xx"},{"$f":"IF($C65=\"Ja\",INDEX(Grundkarakterer!R$8:R$41,$AE28),\"xx\")","v":"xx"},{"$f":"IF($C65=\"Ja\",INDEX(Grundkarakterer!S$8:S$41,$AE28),\"xx\")","v":"xx"},{"$f":"IF($C65=\"Ja\",INDEX(Grundkarakterer!T$8:T$41,$AE28),\"xx\")","v":"xx"},{"$f":"IF($C65=\"Ja\",INDEX(Grundkarakterer!U$8:U$41,$AE28),\"xx\")","v":"xx"},{"$f":"IF($C65=\"Ja\",INDEX(Grundkarakterer!V$8:V$41,$AE28),\"xx\")","v":"xx"},{"$f":"IF($C65=\"Ja\",INDEX(Grundkarakterer!W$8:W$41,$AE28),\"xx\")","v":"xx"},{"$f":"IF($C65=\"Ja\",INDEX(Grundkarakterer!X$8:X$41,$AE28),\"xx\")","v":"xx"},{"$f":"IF($C65=\"Ja\",INDEX(Grundkarakterer!Y$8:Y$41,$AE28),\"xx\")","v":"xx"},{"$f":"IF($C65=\"Ja\",INDEX(Grundkarakterer!Z$8:Z$41,$AE28),\"xx\")","v":"xx"},{"$f":"IF($C65=\"Ja\",INDEX(Grundkarakterer!AA$8:AA$41,$AE28),\"xx\")","v":"xx"},{"$f":"IF($C65=\"Ja\",INDEX(Grundkarakterer!AB$8:AB$41,$AE28),\"xx\")","v":"xx"},{"$f":"IF($C65=\"Ja\",INDEX(Grundkarakterer!AC$8:AC$41,$AE28),\"xx\")","v":"xx"},{"$f":"IF($C65=\"Ja\",INDEX(Grundkarakterer!G$8:G$41,$AE28),\"xx\")","v":"xx"}]
[27,{"$f":"INDEX(Grundkarakterer!A$8:A$41,AE29)","v":27},"Nej",{"$f":"IF(C66=\"Ja\",INDEX(Grundkarakterer!B$8:B$41,AE29),\"xx\")","v":"xx"},{"$f":"IF(C66=\"Ja\",INDEX(Grundkarakterer!C$8:C$41,$AE29),\"xx\")","v":"xx"},{"$f":"IF(C66=\"Ja\",INDEX(Grundkarakterer!D$8:D$41,$AE29),\"xx\")","v":"xx"},{"$f":"IF(C66=\"Ja\",INDEX(Grundkarakterer!E$8:E$41,$AE29),\"xx\")","v":"xx"},{"$f":"IF($C66=\"Ja\",INDEX(Grundkarakterer!F$8:F$41,$AE29),\"xx\")","v":"xx"},{"$f":"IF($C66=\"Ja\",INDEX(Grundkarakterer!H$8:H$41,$AE29),\"xx\")","v":"xx"},{"$f":"IF($C66=\"Ja\",INDEX(Grundkarakterer!I$8:I$41,$AE29),\"xx\")","v":"xx"},{"$f":"IF($C66=\"Ja\",INDEX(Grundkarakterer!J$8:J$41,$AE29),\"xx\")","v":"xx"},{"$f":"IF($C66=\"Ja\",INDEX(Grundkarakterer!K$8:K$41,$AE29),\"xx\")","v":"xx"},{"$f":"IF($C66=\"Ja\",INDEX(Grundkarakterer!L$8:L$41,$AE29),\"xx\")","v":"xx"},{"$f":"IF($C66=\"Ja\",INDEX(Grundkarakterer!M$8:M$41,$AE29),\"xx\")","v":"xx"},{"$f":"IF($C66=\"Ja\",INDEX(Grundkarakterer!N$8:N$41,$AE29),\"xx\")","v":"xx"},{"$f":"IF($C66=\"Ja\",INDEX(Grundkarakterer!O$8:O$41,$AE29),\"xx\")","v":"xx"},{"$f":"IF($C66=\"Ja\",INDEX(Grundkarakterer!P$8:P$41,$AE29),\"xx\")","v":"xx"},{"$f":"IF($C66=\"Ja\",INDEX(Grundkarakterer!Q$8:Q$41,$AE29),\"xx\")","v":"xx"},{"$f":"IF($C66=\"Ja\",INDEX(Grundkarakterer!R$8:R$41,$AE29),\"xx\")","v":"xx"},{"$f":"IF($C66=\"Ja\",INDEX(Grundkarakterer!S$8:S$41,$AE29),\"xx\")","v":"xx"},{"$f":"IF($C66=\"Ja\",INDEX(Grundkarakterer!T$8:T$41,$AE29),\"xx\")","v":"xx"},{"$f":"IF($C66=\"Ja\",INDEX(Grundkarakterer!U$8:U$41,$AE29),\"xx\")","v":"xx"},{"$f":"IF($C66=\"Ja\",INDEX(Grundkarakterer!V$8:V$41,$AE29),\"xx\")","v":"xx"},{"$f":"IF($C66=\"Ja\",INDEX(Grundkarakterer!W$8:W$41,$AE29),\"xx\")","v":"xx"},{"$f":"IF($C66=\"Ja\",INDEX(Grundkarakterer!X$8:X$41,$AE29),\"xx\")","v":"xx"},{"$f":"IF($C66=\"Ja\",INDEX(Grundkarakterer!Y$8:Y$41,$AE29),\"xx\")","v":"xx"},{"$f":"IF($C66=\"Ja\",INDEX(Grundkarakterer!Z$8:Z$41,$AE29),\"xx\")","v":"xx"},{"$f":"IF($C66=\"Ja\",INDEX(Grundkarakterer!AA$8:AA$41,$AE29),\"xx\")","v":"xx"},{"$f":"IF($C66=\"Ja\",INDEX(Grundkarakterer!AB$8:AB$41,$AE29),\"xx\")","v":"xx"},{"$f":"IF($C66=\"Ja\",INDEX(Grundkarakterer!AC$8:AC$41,$AE29),\"xx\")","v":"xx"},{"$f":"IF($C66=\"Ja\",INDEX(Grundkarakterer!G$8:G$41,$AE29),\"xx\")","v":"xx"}]
[28,{"$f":"INDEX(Grundkarakterer!A$8:A$41,AE30)","v":28},"Nej",{"$f":"IF(C67=\"Ja\",INDEX(Grundkarakterer!B$8:B$41,AE30),\"xx\")","v":"xx"},{"$f":"IF(C67=\"Ja\",INDEX(Grundkarakterer!C$8:C$41,$AE30),\"xx\")","v":"xx"},{"$f":"IF(C67=\"Ja\",INDEX(Grundkarakterer!D$8:D$41,$AE30),\"xx\")","v":"xx"},{"$f":"IF(C67=\"Ja\",INDEX(Grundkarakterer!E$8:E$41,$AE30),\"xx\")","v":"xx"},{"$f":"IF($C67=\"Ja\",INDEX(Grundkarakterer!F$8:F$41,$AE30),\"xx\")","v":"xx"},{"$f":"IF($C67=\"Ja\",INDEX(Grundkarakterer!H$8:H$41,$AE30),\"xx\")","v":"xx"},{"$f":"IF($C67=\"Ja\",INDEX(Grundkarakterer!I$8:I$41,$AE30),\"xx\")","v":"xx"},{"$f":"IF($C67=\"Ja\",INDEX(Grundkarakterer!J$8:J$41,$AE30),\"xx\")","v":"xx"},{"$f":"IF($C67=\"Ja\",INDEX(Grundkarakterer!K$8:K$41,$AE30),\"xx\")","v":"xx"},{"$f":"IF($C67=\"Ja\",INDEX(Grundkarakterer!L$8:L$41,$AE30),\"xx\")","v":"xx"},{"$f":"IF($C67=\"Ja\",INDEX(Grundkarakterer!M$8:M$41,$AE30),\"xx\")","v":"xx"},{"$f":"IF($C67=\"Ja\",INDEX(Grundkarakterer!N$8:N$41,$AE30),\"xx\")","v":"xx"},{"$f":"IF($C67=\"Ja\",INDEX(Grundkarakterer!O$8:O$41,$AE30),\"xx\")","v":"xx"},{"$f":"IF($C67=\"Ja\",INDEX(Grundkarakterer!P$8:P$41,$AE30),\"xx\")","v":"xx"},{"$f":"IF($C67=\"Ja\",INDEX(Grundkarakterer!Q$8:Q$41,$AE30),\"xx\")","v":"xx"},{"$f":"IF($C67=\"Ja\",INDEX(Grundkarakterer!R$8:R$41,$AE30),\"xx\")","v":"xx"},{"$f":"IF($C67=\"Ja\",INDEX(Grundkarakterer!S$8:S$41,$AE30),\"xx\")","v":"xx"},{"$f":"IF($C67=\"Ja\",INDEX(Grundkarakterer!T$8:T$41,$AE30),\"xx\")","v":"xx"},{"$f":"IF($C67=\"Ja\",INDEX(Grundkarakterer!U$8:U$41,$AE30),\"xx\")","v":"xx"},{"$f":"IF($C67=\"Ja\",INDEX(Grundkarakterer!V$8:V$41,$AE30),\"xx\")","v":"xx"},{"$f":"IF($C67=\"Ja\",INDEX(Grundkarakterer!W$8:W$41,$AE30),\"xx\")","v":"xx"},{"$f":"IF($C67=\"Ja\",INDEX(Grundkarakterer!X$8:X$41,$AE30),\"xx\")","v":"xx"},{"$f":"IF($C67=\"Ja\",INDEX(Grundkarakterer!Y$8:Y$41,$AE30),\"xx\")","v":"xx"},{"$f":"IF($C67=\"Ja\",INDEX(Grundkarakterer!Z$8:Z$41,$AE30),\"xx\")","v":"xx"},{"$f":"IF($C67=\"Ja\",INDEX(Grundkarakterer!AA$8:AA$41,$AE30),\"xx\")","v":"xx"},{"$f":"IF($C67=\"Ja\",INDEX(Grundkarakterer!AB$8:AB$41,$AE30),\"xx\")","v":"xx"},{"$f":"IF($C67=\"Ja\",INDEX(Grundkarakterer!AC$8:AC$41,$AE30),\"xx\")","v":"xx"},{"$f":"IF($C67=\"Ja\",INDEX(Grundkarakterer!G$8:G$41,$AE30),\"xx\")","v":"xx"}]
[29,{"$f":"INDEX(Grundkarakterer!A$8:A$41,AE31)","v":29},"Nej",{"$f":"IF(C68=\"Ja\",INDEX(Grundkarakterer!B$8:B$41,AE31),\"xx\")","v":"xx"},{"$f":"IF(C68=\"Ja\",INDEX(Grundkarakterer!C$8:C$41,$AE31),\"xx\")","v":"xx"},{"$f":"IF(C68=\"Ja\",INDEX(Grundkarakterer!D$8:D$41,$AE31),\"xx\")","v":"xx"},{"$f":"IF(C68=\"Ja\",INDEX(Grundkarakterer!E$8:E$41,$AE31),\"xx\")","v":"xx"},{"$f":"IF($C68=\"Ja\",INDEX(Grundkarakterer!F$8:F$41,$AE31),\"xx\")","v":"xx"},{"$f":"IF($C68=\"Ja\",INDEX(Grundkarakterer!H$8:H$41,$AE31),\"xx\")","v":"xx"},{"$f":"IF($C68=\"Ja\",INDEX(Grundkarakterer!I$8:I$41,$AE31),\"xx\")","v":"xx"},{"$f":"IF($C68=\"Ja\",INDEX(Grundkarakterer!J$8:J$41,$AE31),\"xx\")","v":"xx"},{"$f":"IF($C68=\"Ja\",INDEX(Grundkarakterer!K$8:K$41,$AE31),\"xx\")","v":"xx"},{"$f":"IF($C68=\"Ja\",INDEX(Grundkarakterer!L$8:L$41,$AE31),\"xx\")","v":"xx"},{"$f":"IF($C68=\"Ja\",INDEX(Grundkarakterer!M$8:M$41,$AE31),\"xx\")","v":"xx"},{"$f":"IF($C68=\"Ja\",INDEX(Grundkarakterer!N$8:N$41,$AE31),\"xx\")","v":"xx"},{"$f":"IF($C68=\"Ja\",INDEX(Grundkarakterer!O$8:O$41,$AE31),\"xx\")","v":"xx"},{"$f":"IF($C68=\"Ja\",INDEX(Grundkarakterer!P$8:P$41,$AE31),\"xx\")","v":"xx"},{"$f":"IF($C68=\"Ja\",INDEX(Grundkarakterer!Q$8:Q$41,$AE31),\"xx\")","v":"xx"},{"$f":"IF($C68=\"Ja\",INDEX(Grundkarakterer!R$8:R$41,$AE31),\"xx\")","v":"xx"},{"$f":"IF($C68=\"Ja\",INDEX(Grundkarakterer!S$8:S$41,$AE31),\"xx\")","v":"xx"},{"$f":"IF($C68=\"Ja\",INDEX(Grundkarakterer!T$8:T$41,$AE31),\"xx\")","v":"xx"},{"$f":"IF($C68=\"Ja\",INDEX(Grundkarakterer!U$8:U$41,$AE31),\"xx\")","v":"xx"},{"$f":"IF($C68=\"Ja\",INDEX(Grundkarakterer!V$8:V$41,$AE31),\"xx\")","v":"xx"},{"$f":"IF($C68=\"Ja\",INDEX(Grundkarakterer!W$8:W$41,$AE31),\"xx\")","v":"xx"},{"$f":"IF($C68=\"Ja\",INDEX(Grundkarakterer!X$8:X$41,$AE31),\"xx\")","v":"xx"},{"$f":"IF($C68=\"Ja\",INDEX(Grundkarakterer!Y$8:Y$41,$AE31),\"xx\")","v":"xx"},{"$f":"IF($C68=\"Ja\",INDEX(Grundkarakterer!Z$8:Z$41,$AE31),\"xx\")","v":"xx"},{"$f":"IF($C68=\"Ja\",INDEX(Grundkarakterer!AA$8:AA$41,$AE31),\"xx\")","v":"xx"},{"$f":"IF($C68=\"Ja\",INDEX(Grundkarakterer!AB$8:AB$41,$AE31),\"xx\")","v":"xx"},{"$f":"IF($C68=\"Ja\",INDEX(Grundkarakterer!AC$8:AC$41,$AE31),\"xx\")","v":"xx"},{"$f":"IF($C68=\"Ja\",INDEX(Grundkarakterer!G$8:G$41,$AE31),\"xx\")","v":"xx"}]
[30,{"$f":"INDEX(Grundkarakterer!A$8:A$41,AE32)","v":30},"Nej",{"$f":"IF(C69=\"Ja\",INDEX(Grundkarakterer!B$8:B$41,AE32),\"xx\")","v":"xx"},{"$f":"IF(C69=\"Ja\",INDEX(Grundkarakterer!C$8:C$41,$AE32),\"xx\")","v":"xx"},{"$f":"IF(C69=\"Ja\",INDEX(Grundkarakterer!D$8:D$41,$AE32),\"xx\")","v":"xx"},{"$f":"IF(C69=\"Ja\",INDEX(Grundkarakterer!E$8:E$41,$AE32),\"xx\")","v":"xx"},{"$f":"IF($C69=\"Ja\",INDEX(Grundkarakterer!F$8:F$41,$AE32),\"xx\")","v":"xx"},{"$f":"IF($C69=\"Ja\",INDEX(Grundkarakterer!H$8:H$41,$AE32),\"xx\")","v":"xx"},{"$f":"IF($C69=\"Ja\",INDEX(Grundkarakterer!I$8:I$41,$AE32),\"xx\")","v":"xx"},{"$f":"IF($C69=\"Ja\",INDEX(Grundkarakterer!J$8:J$41,$AE32),\"xx\")","v":"xx"},{"$f":"IF($C69=\"Ja\",INDEX(Grundkarakterer!K$8:K$41,$AE32),\"xx\")","v":"xx"},{"$f":"IF($C69=\"Ja\",INDEX(Grundkarakterer!L$8:L$41,$AE32),\"xx\")","v":"xx"},{"$f":"IF($C69=\"Ja\",INDEX(Grundkarakterer!M$8:M$41,$AE32),\"xx\")","v":"xx"},{"$f":"IF($C69=\"Ja\",INDEX(Grundkarakterer!N$8:N$41,$AE32),\"xx\")","v":"xx"},{"$f":"IF($C69=\"Ja\",INDEX(Grundkarakterer!O$8:O$41,$AE32),\"xx\")","v":"xx"},{"$f":"IF($C69=\"Ja\",INDEX(Grundkarakterer!P$8:P$41,$AE32),\"xx\")","v":"xx"},{"$f":"IF($C69=\"Ja\",INDEX(Grundkarakterer!Q$8:Q$41,$AE32),\"xx\")","v":"xx"},{"$f":"IF($C69=\"Ja\",INDEX(Grundkarakterer!R$8:R$41,$AE32),\"xx\")","v":"xx"},{"$f":"IF($C69=\"Ja\",INDEX(Grundkarakterer!S$8:S$41,$AE32),\"xx\")","v":"xx"},{"$f":"IF($C69=\"Ja\",INDEX(Grundkarakterer!T$8:T$41,$AE32),\"xx\")","v":"xx"},{"$f":"IF($C69=\"Ja\",INDEX(Grundkarakterer!U$8:U$41,$AE32),\"xx\")","v":"xx"},{"$f":"IF($C69=\"Ja\",INDEX(Grundkarakterer!V$8:V$41,$AE32),\"xx\")","v":"xx"},{"$f":"IF($C69=\"Ja\",INDEX(Grundkarakterer!W$8:W$41,$AE32),\"xx\")","v":"xx"},{"$f":"IF($C69=\"Ja\",INDEX(Grundkarakterer!X$8:X$41,$AE32),\"xx\")","v":"xx"},{"$f":"IF($C69=\"Ja\",INDEX(Grundkarakterer!Y$8:Y$41,$AE32),\"xx\")","v":"xx"},{"$f":"IF($C69=\"Ja\",INDEX(Grundkarakterer!Z$8:Z$41,$AE32),\"xx\")","v":"xx"},{"$f":"IF($C69=\"Ja\",INDEX(Grundkarakterer!AA$8:AA$41,$AE32),\"xx\")","v":"xx"},{"$f":"IF($C69=\"Ja\",INDEX(Grundkarakterer!AB$8:AB$41,$AE32),\"xx\")","v":"xx"},{"$f":"IF($C69=\"Ja\",INDEX(Grundkarakterer!AC$8:AC$41,$AE32),\"xx\")","v":"xx"},{"$f":"IF($C69=\"Ja\",INDEX(Grundkarakterer!G$8:G$41,$AE32),\"xx\")","v":"xx"}]
[31,{"$f":"INDEX(Grundkarakterer!A$8:A$41,AE33)","v":31},"Nej",{"$f":"IF(C70=\"Ja\",INDEX(Grundkarakterer!B$8:B$41,AE33),\"xx\")","v":"xx"},{"$f":"IF(C70=\"Ja\",INDEX(Grundkarakterer!C$8:C$41,$AE33),\"xx\")","v":"xx"},{"$f":"IF(C70=\"Ja\",INDEX(Grundkarakterer!D$8:D$41,$AE33),\"xx\")","v":"xx"},{"$f":"IF(C70=\"Ja\",INDEX(Grundkarakterer!E$8:E$41,$AE33),\"xx\")","v":"xx"},{"$f":"IF($C70=\"Ja\",INDEX(Grundkarakterer!F$8:F$41,$AE33),\"xx\")","v":"xx"},{"$f":"IF($C70=\"Ja\",INDEX(Grundkarakterer!H$8:H$41,$AE33),\"xx\")","v":"xx"},{"$f":"IF($C70=\"Ja\",INDEX(Grundkarakterer!I$8:I$41,$AE33),\"xx\")","v":"xx"},{"$f":"IF($C70=\"Ja\",INDEX(Grundkarakterer!J$8:J$41,$AE33),\"xx\")","v":"xx"},{"$f":"IF($C70=\"Ja\",INDEX(Grundkarakterer!K$8:K$41,$AE33),\"xx\")","v":"xx"},{"$f":"IF($C70=\"Ja\",INDEX(Grundkarakterer!L$8:L$41,$AE33),\"xx\")","v":"xx"},{"$f":"IF($C70=\"Ja\",INDEX(Grundkarakterer!M$8:M$41,$AE33),\"xx\")","v":"xx"},{"$f":"IF($C70=\"Ja\",INDEX(Grundkarakterer!N$8:N$41,$AE33),\"xx\")","v":"xx"},{"$f":"IF($C70=\"Ja\",INDEX(Grundkarakterer!O$8:O$41,$AE33),\"xx\")","v":"xx"},{"$f":"IF($C70=\"Ja\",INDEX(Grundkarakterer!P$8:P$41,$AE33),\"xx\")","v":"xx"},{"$f":"IF($C70=\"Ja\",INDEX(Grundkarakterer!Q$8:Q$41,$AE33),\"xx\")","v":"xx"},{"$f":"IF($C70=\"Ja\",INDEX(Grundkarakterer!R$8:R$41,$AE33),\"xx\")","v":"xx"},{"$f":"IF($C70=\"Ja\",INDEX(Grundkarakterer!S$8:S$41,$AE33),\"xx\")","v":"xx"},{"$f":"IF($C70=\"Ja\",INDEX(Grundkarakterer!T$8:T$41,$AE33),\"xx\")","v":"xx"},{"$f":"IF($C70=\"Ja\",INDEX(Grundkarakterer!U$8:U$41,$AE33),\"xx\")","v":"xx"},{"$f":"IF($C70=\"Ja\",INDEX(Grundkarakterer!V$8:V$41,$AE33),\"xx\")","v":"xx"},{"$f":"IF($C70=\"Ja\",INDEX(Grundkarakterer!W$8:W$41,$AE33),\"xx\")","v":"xx"},{"$f":"IF($C70=\"Ja\",INDEX(Grundkarakterer!X$8:X$41,$AE33),\"xx\")","v":"xx"},{"$f":"IF($C70=\"Ja\",INDEX(Grundkarakterer!Y$8:Y$41,$AE33),\"xx\")","v":"xx"},{"$f":"IF($C70=\"Ja\",INDEX(Grundkarakterer!Z$8:Z$41,$AE33),\"xx\")","v":"xx"},{"$f":"IF($C70=\"Ja\",INDEX(Grundkarakterer!AA$8:AA$41,$AE33),\"xx\")","v":"xx"},{"$f":"IF($C70=\"Ja\",INDEX(Grundkarakterer!AB$8:AB$41,$AE33),\"xx\")","v":"xx"},{"$f":"IF($C70=\"Ja\",INDEX(Grundkarakterer!AC$8:AC$41,$AE33),\"xx\")","v":"xx"},{"$f":"IF($C70=\"Ja\",INDEX(Grundkarakterer!G$8:G$41,$AE33),\"xx\")","v":"xx"}]
[32,{"$f":"INDEX(Grundkarakterer!A$8:A$41,AE34)","v":32},"Nej",{"$f":"IF(C71=\"Ja\",INDEX(Grundkarakterer!B$8:B$41,AE34),\"xx\")","v":"xx"},{"$f":"IF(C71=\"Ja\",INDEX(Grundkarakterer!C$8:C$41,$AE34),\"xx\")","v":"xx"},{"$f":"IF(C71=\"Ja\",INDEX(Grundkarakterer!D$8:D$41,$AE34),\"xx\")","v":"xx"},{"$f":"IF(C71=\"Ja\",INDEX(Grundkarakterer!E$8:E$41,$AE34),\"xx\")","v":"xx"},{"$f":"IF($C71=\"Ja\",INDEX(Grundkarakterer!F$8:F$41,$AE34),\"xx\")","v":"xx"},{"$f":"IF($C71=\"Ja\",INDEX(Grundkarakterer!H$8:H$41,$AE34),\"xx\")","v":"xx"},{"$f":"IF($C71=\"Ja\",INDEX(Grundkarakterer!I$8:I$41,$AE34),\"xx\")","v":"xx"},{"$f":"IF($C71=\"Ja\",INDEX(Grundkarakterer!J$8:J$41,$AE34),\"xx\")","v":"xx"},{"$f":"IF($C71=\"Ja\",INDEX(Grundkarakterer!K$8:K$41,$AE34),\"xx\")","v":"xx"},{"$f":"IF($C71=\"Ja\",INDEX(Grundkarakterer!L$8:L$41,$AE34),\"xx\")","v":"xx"},{"$f":"IF($C71=\"Ja\",INDEX(Grundkarakterer!M$8:M$41,$AE34),\"xx\")","v":"xx"},{"$f":"IF($C71=\"Ja\",INDEX(Grundkarakterer!N$8:N$41,$AE34),\"xx\")","v":"xx"},{"$f":"IF($C71=\"Ja\",INDEX(Grundkarakterer!O$8:O$41,$AE34),\"xx\")","v":"xx"},{"$f":"IF($C71=\"Ja\",INDEX(Grundkarakterer!P$8:P$41,$AE34),\"xx\")","v":"xx"},{"$f":"IF($C71=\"Ja\",INDEX(Grundkarakterer!Q$8:Q$41,$AE34),\"xx\")","v":"xx"},{"$f":"IF($C71=\"Ja\",INDEX(Grundkarakterer!R$8:R$41,$AE34),\"xx\")","v":"xx"},{"$f":"IF($C71=\"Ja\",INDEX(Grundkarakterer!S$8:S$41,$AE34),\"xx\")","v":"xx"},{"$f":"IF($C71=\"Ja\",INDEX(Grundkarakterer!T$8:T$41,$AE34),\"xx\")","v":"xx"},{"$f":"IF($C71=\"Ja\",INDEX(Grundkarakterer!U$8:U$41,$AE34),\"xx\")","v":"xx"},{"$f":"IF($C71=\"Ja\",INDEX(Grundkarakterer!V$8:V$41,$AE34),\"xx\")","v":"xx"},{"$f":"IF($C71=\"Ja\",INDEX(Grundkarakterer!W$8:W$41,$AE34),\"xx\")","v":"xx"},{"$f":"IF($C71=\"Ja\",INDEX(Grundkarakterer!X$8:X$41,$AE34),\"xx\")","v":"xx"},{"$f":"IF($C71=\"Ja\",INDEX(Grundkarakterer!Y$8:Y$41,$AE34),\"xx\")","v":"xx"},{"$f":"IF($C71=\"Ja\",INDEX(Grundkarakterer!Z$8:Z$41,$AE34),\"xx\")","v":"xx"},{"$f":"IF($C71=\"Ja\",INDEX(Grundkarakterer!AA$8:AA$41,$AE34),\"xx\")","v":"xx"},{"$f":"IF($C71=\"Ja\",INDEX(Grundkarakterer!AB$8:AB$41,$AE34),\"xx\")","v":"xx"},{"$f":"IF($C71=\"Ja\",INDEX(Grundkarakterer!AC$8:AC$41,$AE34),\"xx\")","v":"xx"},{"$f":"IF($C71=\"Ja\",INDEX(Grundkarakterer!G$8:G$41,$AE34),\"xx\")","v":"xx"}]
[33,{"$f":"INDEX(Grundkarakterer!A$8:A$41,AE35)","v":33},"Nej",{"$f":"IF(C72=\"Ja\",INDEX(Grundkarakterer!B$8:B$41,AE35),\"xx\")","v":"xx"},{"$f":"IF(C72=\"Ja\",INDEX(Grundkarakterer!C$8:C$41,$AE35),\"xx\")","v":"xx"},{"$f":"IF(C72=\"Ja\",INDEX(Grundkarakterer!D$8:D$41,$AE35),\"xx\")","v":"xx"},{"$f":"IF(C72=\"Ja\",INDEX(Grundkarakterer!E$8:E$41,$AE35),\"xx\")","v":"xx"},{"$f":"IF($C72=\"Ja\",INDEX(Grundkarakterer!F$8:F$41,$AE35),\"xx\")","v":"xx"},{"$f":"IF($C72=\"Ja\",INDEX(Grundkarakterer!H$8:H$41,$AE35),\"xx\")","v":"xx"},{"$f":"IF($C72=\"Ja\",INDEX(Grundkarakterer!I$8:I$41,$AE35),\"xx\")","v":"xx"},{"$f":"IF($C72=\"Ja\",INDEX(Grundkarakterer!J$8:J$41,$AE35),\"xx\")","v":"xx"},{"$f":"IF($C72=\"Ja\",INDEX(Grundkarakterer!K$8:K$41,$AE35),\"xx\")","v":"xx"},{"$f":"IF($C72=\"Ja\",INDEX(Grundkarakterer!L$8:L$41,$AE35),\"xx\")","v":"xx"},{"$f":"IF($C72=\"Ja\",INDEX(Grundkarakterer!M$8:M$41,$AE35),\"xx\")","v":"xx"},{"$f":"IF($C72=\"Ja\",INDEX(Grundkarakterer!N$8:N$41,$AE35),\"xx\")","v":"xx"},{"$f":"IF($C72=\"Ja\",INDEX(Grundkarakterer!O$8:O$41,$AE35),\"xx\")","v":"xx"},{"$f":"IF($C72=\"Ja\",INDEX(Grundkarakterer!P$8:P$41,$AE35),\"xx\")","v":"xx"},{"$f":"IF($C72=\"Ja\",INDEX(Grundkarakterer!Q$8:Q$41,$AE35),\"xx\")","v":"xx"},{"$f":"IF($C72=\"Ja\",INDEX(Grundkarakterer!R$8:R$41,$AE35),\"xx\")","v":"xx"},{"$f":"IF($C72=\"Ja\",INDEX(Grundkarakterer!S$8:S$41,$AE35),\"xx\")","v":"xx"},{"$f":"IF($C72=\"Ja\",INDEX(Grundkarakterer!T$8:T$41,$AE35),\"xx\")","v":"xx"},{"$f":"IF($C72=\"Ja\",INDEX(Grundkarakterer!U$8:U$41,$AE35),\"xx\")","v":"xx"},{"$f":"IF($C72=\"Ja\",INDEX(Grundkarakterer!V$8:V$41,$AE35),\"xx\")","v":"xx"},{"$f":"IF($C72=\"Ja\",INDEX(Grundkarakterer!W$8:W$41,$AE35),\"xx\")","v":"xx"},{"$f":"IF($C72=\"Ja\",INDEX(Grundkarakterer!X$8:X$41,$AE35),\"xx\")","v":"xx"},{"$f":"IF($C72=\"Ja\",INDEX(Grundkarakterer!Y$8:Y$41,$AE35),\"xx\")","v":"xx"},{"$f":"IF($C72=\"Ja\",INDEX(Grundkarakterer!Z$8:Z$41,$AE35),\"xx\")","v":"xx"},{"$f":"IF($C72=\"Ja\",INDEX(Grundkarakterer!AA$8:AA$41,$AE35),\"xx\")","v":"xx"},{"$f":"IF($C72=\"Ja\",INDEX(Grundkarakterer!AB$8:AB$41,$AE35),\"xx\")","v":"xx"},{"$f":"IF($C72=\"Ja\",INDEX(Grundkarakterer!AC$8:AC$41,$AE35),\"xx\")","v":"xx"},{"$f":"IF($C72=\"Ja\",INDEX(Grundkarakterer!G$8:G$41,$AE35),\"xx\")","v":"xx"}]
[34,{"$f":"INDEX(Grundkarakterer!A$8:A$41,AE36)","v":34},"Nej",{"$f":"IF(C73=\"Ja\",INDEX(Grundkarakterer!B$8:B$41,AE36),\"xx\")","v":"xx"},{"$f":"IF(C73=\"Ja\",INDEX(Grundkarakterer!C$8:C$41,$AE36),\"xx\")","v":"xx"},{"$f":"IF(C73=\"Ja\",INDEX(Grundkarakterer!D$8:D$41,$AE36),\"xx\")","v":"xx"},{"$f":"IF(C73=\"Ja\",INDEX(Grundkarakterer!E$8:E$41,$AE36),\"xx\")","v":"xx"},{"$f":"IF($C73=\"Ja\",INDEX(Grundkarakterer!F$8:F$41,$AE36),\"xx\")","v":"xx"},{"$f":"IF($C73=\"Ja\",INDEX(Grundkarakterer!H$8:H$41,$AE36),\"xx\")","v":"xx"},{"$f":"IF($C73=\"Ja\",INDEX(Grundkarakterer!I$8:I$41,$AE36),\"xx\")","v":"xx"},{"$f":"IF($C73=\"Ja\",INDEX(Grundkarakterer!J$8:J$41,$AE36),\"xx\")","v":"xx"},{"$f":"IF($C73=\"Ja\",INDEX(Grundkarakterer!K$8:K$41,$AE36),\"xx\")","v":"xx"},{"$f":"IF($C73=\"Ja\",INDEX(Grundkarakterer!L$8:L$41,$AE36),\"xx\")","v":"xx"},{"$f":"IF($C73=\"Ja\",INDEX(Grundkarakterer!M$8:M$41,$AE36),\"xx\")","v":"xx"},{"$f":"IF($C73=\"Ja\",INDEX(Grundkarakterer!N$8:N$41,$AE36),\"xx\")","v":"xx"},{"$f":"IF($C73=\"Ja\",INDEX(Grundkarakterer!O$8:O$41,$AE36),\"xx\")","v":"xx"},{"$f":"IF($C73=\"Ja\",INDEX(Grundkarakterer!P$8:P$41,$AE36),\"xx\")","v":"xx"},{"$f":"IF($C73=\"Ja\",INDEX(Grundkarakterer!Q$8:Q$41,$AE36),\"xx\")","v":"xx"},{"$f":"IF($C73=\"Ja\",INDEX(Grundkarakterer!R$8:R$41,$AE36),\"xx\")","v":"xx"},{"$f":"IF($C73=\"Ja\",INDEX(Grundkarakterer!S$8:S$41,$AE36),\"xx\")","v":"xx"},{"$f":"IF($C73=\"Ja\",INDEX(Grundkarakterer!T$8:T$41,$AE36),\"xx\")","v":"xx"},{"$f":"IF($C73=\"Ja\",INDEX(Grundkarakterer!U$8:U$41,$AE36),\"xx\")","v":"xx"},{"$f":"IF($C73=\"Ja\",INDEX(Grundkarakterer!V$8:V$41,$AE36),\"xx\")","v":"xx"},{"$f":"IF($C73=\"Ja\",INDEX(Grundkarakterer!W$8:W$41,$AE36),\"xx\")","v":"xx"},{"$f":"IF($C73=\"Ja\",INDEX(Grundkarakterer!X$8:X$41,$AE36),\"xx\")","v":"xx"},{"$f":"IF($C73=\"Ja\",INDEX(Grundkarakterer!Y$8:Y$41,$AE36),\"xx\")","v":"xx"},{"$f":"IF($C73=\"Ja\",INDEX(Grundkarakterer!Z$8:Z$41,$AE36),\"xx\")","v":"xx"},{"$f":"IF($C73=\"Ja\",INDEX(Grundkarakterer!AA$8:AA$41,$AE36),\"xx\")","v":"xx"},{"$f":"IF($C73=\"Ja\",INDEX(Grundkarakterer!AB$8:AB$41,$AE36),\"xx\")","v":"xx"},{"$f":"IF($C73=\"Ja\",INDEX(Grundkarakterer!AC$8:AC$41,$AE36),\"xx\")","v":"xx"},{"$f":"IF($C73=\"Ja\",INDEX(Grundkarakterer!G$8:G$41,$AE36),\"xx\")","v":"xx"}]

{"sheet":"Grundkarakterer","index":4,"n_rows":45,"n_cols":28,"rows_kept":45,"cut":false,"hidden":true,"merged":[]}
["Såtidspunkt",null,"1=sammen med"]
[null,null,"2=før høst"]
[null,null,"3=efter høst"]
[]
[]
[]
["Index","Efterafgrøde","Afgrøde","Tidspunkt","Link","Omkostninger","Nettoomkostninger","Pligtig efterafgrøde","Pligtig mellemafgrøde","MFO-efterafgrøde i blanding","MFO-udlæg","Miljø-efterafgrøder","Frivillige efterafgrøder","Grønne marker (2,3 DE-brug)","Egnet til udlæg efterår i vinterkorn","Egnet til udlæg forår","Egnet til udsåning 2-3 uger før høst","Egnet til udsåning efter tidlig høst (10. august)","Kvælstof-fikserende","Stor kvælstof-eftervirkning","Hurtig og dyb rodvækst på lerjord","Er afgrøden robust mod ukrudtsmidler?","Der findes sorter, der ikke opformerer kålbrok","Der findes sorter, der er sanerende for roecystenematoder",null,"Vinterfast","Egen udsæd kan anvendes","Tiebreak"]
[1,"Alm. rajgræs, dipl., udlæg","1. Vintersæd","1. Ved etablering af primærafgrøde",null,{"$f":"'Hjælpe beregning'!AB12*-1","v":{"$error":"#VALUE!"}},{"$f":"'Hjælpe beregning'!AC12","v":{"$error":"#REF!"}},1,0,0,1,1,1,1,0,3,1,2,0,1,0,2,3,0,null,3,0,1]
[2,"Ital. rajgræs, dipl., udlæg","1. Vintersæd","1. Ved etablering af primærafgrøde",null,{"$f":"'Hjælpe beregning'!AB13*-1","v":{"$error":"#VALUE!"}},{"$f":"'Hjælpe beregning'!AC13","v":{"$error":"#REF!"}},1,0,0,1,1,1,1,0,0,1,2,0,1,0,3,3,0,null,2,0,2]
[3,"Westerwoldisk rajgræs",null,null,null,{"$f":"'Hjælpe beregning'!AB14*-1","v":{"$error":"#VALUE!"}},{"$f":"'Hjælpe beregning'!AC14","v":{"$error":"#REF!"}},1,0,0,1,1,1,1,0,0,0,3,0,1,0,3,3,0,null,3,0,3]
[4,"Strandsvingel, udlæg","1. Vintersæd","1. Ved etablering af primærafgrøde",null,{"$f":"'Hjælpe beregning'!AB15*-1","v":{"$error":"#VALUE!"}},{"$f":"'Hjælpe beregning'!AC15","v":{"$error":"#REF!"}},1,0,0,1,1,1,1,1,3,0,0,0,1,0,1,3,0,null,3,0,4]
[5,"Rødsvingel, udlæg","1. Vintersæd","1. Ved etablering af primærafgrøde",null,{"$f":"'Hjælpe beregning'!AB16*-1","v":{"$error":"#VALUE!"}},{"$f":"'Hjælpe beregning'!AC16","v":{"$error":"#REF!"}},1,0,0,1,1,1,1,1,3,0,0,0,1,0,3,3,0,null,3,0,5]
[6,"Engrapgræs, udlæg","1. Vintersæd","1. Ved etablering af primærafgrøde",null,{"$f":"'Hjælpe beregning'!AB17*-1","v":{"$error":"#VALUE!"}},{"$f":"'Hjælpe beregning'!AC17","v":{"$error":"#REF!"}},1,0,0,1,1,1,1,0,2,0,0,0,1,0,2,3,0,null,3,0,6]
[7,"Hundegræs, udlæg","1. Vintersæd","1. Ved etablering af primærafgrøde",null,{"$f":"'Hjælpe beregning'!AB18*-1","v":{"$error":"#VALUE!"}},{"$f":"'Hjælpe beregning'!AC18","v":{"$error":"#REF!"}},1,0,0,1,1,1,1,0,3,1,1,0,1,0,2,3,0,null,3,0,7]
[8,"Frøgræs, udtjent","1. Vintersæd","1. Ved etablering af primærafgrøde",null,{"$f":"'Hjælpe beregning'!AB19*-1","v":{"$error":"#VALUE!"}},{"$f":"'Hjælpe beregning'!AC19","v":{"$error":"#REF!"}},1,1,0,0,1,1,1,0,0,0,0,0,1,0,3,3,0,null,3,0,8]
[9,"Gul sennep","1. Vintersæd","1. Ved etablering af primærafgrøde",null,{"$f":"'Hjælpe beregning'!AB20*-1","v":{"$error":"#VALUE!"}},{"$f":"'Hjælpe beregning'!AC20","v":{"$error":"#REF!"}},1,1,1,0,1,1,1,0,0,3,3,0,2,2,3,0,3,null,0,0,9]
[10,"Olieræddike","1. Vintersæd","1. Ved etablering af primærafgrøde",null,{"$f":"'Hjælpe beregning'!AB21*-1","v":{"$error":"#VALUE!"}},{"$f":"'Hjælpe beregning'!AC21","v":{"$error":"#REF!"}},1,1,1,0,1,1,1,0,0,3,3,0,2,3,3,2,3,null,0,0,10]
[11,"Vinterraps, hybrid",null,null,null,{"$f":"'Hjælpe beregning'!AB22*-1","v":{"$error":"#VALUE!"}},{"$f":"'Hjælpe beregning'!AC22","v":{"$error":"#REF!"}},1,0,1,0,1,1,1,0,0,2,2,0,2,3,3,0,0,null,3,0,11]
[12,"Vinterraps , linie","1. Vintersæd","1. Ved etablering af primærafgrøde",null,{"$f":"'Hjælpe beregning'!AB23*-1","v":{"$error":"#VALUE!"}},{"$f":"'Hjælpe beregning'!AC23","v":{"$error":"#REF!"}},1,0,1,0,1,1,1,0,0,2,2,0,2,3,3,0,0,null,3,1,12]
[13,"Foderradise (Strukturator)",null,null,null,{"$f":"'Hjælpe beregning'!AB24*-1","v":{"$error":"#VALUE!"}},{"$f":"'Hjælpe beregning'!AC24","v":{"$error":"#REF!"}},1,0,1,0,1,1,1,0,0,3,3,0,2,3,3,2,0,null,0,0,13]
[14,"Havre, sået inden 1. august","1. Vintersæd","1. Ved etablering af primærafgrøde",null,{"$f":"'Hjælpe beregning'!AB25*-1","v":{"$error":"#VALUE!"}},{"$f":"'Hjælpe beregning'!AC25","v":{"$error":"#REF!"}},1,0,1,0,1,1,1,0,0,1,2,0,1,1,3,3,0,null,1,1,14]
[15,"Havre, sået mellem 1. og 20. august",null,null,null,{"$f":"'Hjælpe beregning'!AB26*-1","v":{"$error":"#VALUE!"}},{"$f":"'Hjælpe beregning'!AC26","v":{"$error":"#REF!"}},0,0,0,0,1,1,1,0,0,0,1,0,1,1,3,3,0,null,1,1,15]
[16,"Stauderug, sået inden 1. august","1. Vintersæd","1. Ved etablering af primærafgrøde",null,{"$f":"'Hjælpe beregning'!AB27*-1","v":{"$error":"#VALUE!"}},{"$f":"'Hjælpe beregning'!AC27","v":{"$error":"#REF!"}},1,0,1,0,1,1,1,0,0,1,2,0,1,1,3,3,0,null,3,0,16]
[17,"Stauderug, sået mellem 1. og 20. august",null,null,null,{"$f":"'Hjælpe beregning'!AB28*-1","v":{"$error":"#VALUE!"}},{"$f":"'Hjælpe beregning'!AC28","v":{"$error":"#REF!"}},1,0,1,0,1,1,1,0,0,0,1,0,1,1,3,3,0,null,3,0,17]
[18,"Vårbyg, sået inden 1. august","1. Vintersæd","1. Ved etablering af primærafgrøde",null,{"$f":"'Hjælpe beregning'!AB29*-1","v":{"$error":"#VALUE!"}},{"$f":"'Hjælpe beregning'!AC29","v":{"$error":"#REF!"}},1,0,1,0,1,1,1,0,0,1,2,0,1,0,3,3,0,null,1,1,18]
[19,"Vårbyg, sået mellem 1. og 20. august",null,null,null,{"$f":"'Hjælpe beregning'!AB30*-1","v":{"$error":"#VALUE!"}},{"$f":"'Hjælpe beregning'!AC30","v":{"$error":"#REF!"}},1,0,1,0,1,1,1,0,0,0,1,0,1,0,3,3,0,null,1,1,19]
[20,"Vinterrug (population), sået inden 1. august",null,null,null,{"$f":"'Hjælpe beregning'!AB31*-1","v":{"$error":"#VALUE!"}},{"$f":"'Hjælpe beregning'!AC31","v":{"$error":"#REF!"}},1,0,1,0,1,1,1,0,0,1,2,0,1,1,3,3,0,null,3,1,20]
[21,"Vinterrug (population), sået inden 20. august",null,null,null,{"$f":"'Hjælpe beregning'!AB32*-1","v":{"$error":"#VALUE!"}},{"$f":"'Hjælpe beregning'!AC32","v":{"$error":"#REF!"}},1,0,1,0,1,1,1,0,0,0,1,0,1,1,3,3,0,null,3,1,21]
[22,"Vinterrug (hybrid og syntetisk), sået inden 1. august","1. Vintersæd","1. Ved etablering af primærafgrøde",null,{"$f":"'Hjælpe beregning'!AB33*-1","v":{"$error":"#VALUE!"}},{"$f":"'Hjælpe beregning'!AC33","v":{"$error":"#REF!"}},1,0,1,0,1,1,1,0,0,1,2,0,1,1,3,3,0,null,3,0,22]
[23,"Vinterrug (hybrid og syntetisk), sået inden 20. august",null,null,null,{"$f":"'Hjælpe beregning'!AB34*-1","v":{"$error":"#VALUE!"}},{"$f":"'Hjælpe beregning'!AC34","v":{"$error":"#REF!"}},1,0,1,0,1,1,1,0,0,0,1,0,1,1,3,3,0,null,3,0,23]
[24,"Cikorie","1. Vintersæd","1. Ved etablering af primærafgrøde",null,{"$f":"'Hjælpe beregning'!AB35*-1","v":{"$error":"#VALUE!"}},{"$f":"'Hjælpe beregning'!AC35","v":{"$error":"#REF!"}},1,0,1,0,1,1,1,0,3,0,0,0,2,3,0,3,0,null,2,0,24]
[25,"Honningurt","1. Vintersæd","1. Ved etablering af primærafgrøde",null,{"$f":"'Hjælpe beregning'!AB36*-1","v":{"$error":"#VALUE!"}},{"$f":"'Hjælpe beregning'!AC36","v":{"$error":"#REF!"}},1,0,1,0,1,1,1,0,0,2,3,0,2,3,3,3,0,null,0,1,25]
[26,"Fodervikke ","1. Vintersæd","1. Ved etablering af primærafgrøde",null,{"$f":"'Hjælpe beregning'!AB37*-1","v":{"$error":"#VALUE!"}},{"$f":"'Hjælpe beregning'!AC37","v":{"$error":"#REF!"}},0,0,0,0,1,1,1,0,0,3,3,1,3,0,3,3,0,null,0,1,26]
[27,"Vintervikke","1. Vintersæd","1. Ved etablering af primærafgrøde",null,{"$f":"'Hjælpe beregning'!AB38*-1","v":{"$error":"#VALUE!"}},{"$f":"'Hjælpe beregning'!AC38","v":{"$error":"#REF!"}},0,0,0,1,1,1,1,0,0,0,3,1,3,0,3,3,0,null,3,0,27]
[28,"Alexandrinekløver","1. Vintersæd","1. Ved etablering af primærafgrøde",null,{"$f":"'Hjælpe beregning'!AB39*-1","v":{"$error":"#VALUE!"}},{"$f":"'Hjælpe beregning'!AC39","v":{"$error":"#REF!"}},0,0,0,0,1,1,1,0,2,3,2,1,3,0,3,3,0,null,0,1,28]
[29,"Hvidkløver","1. Vintersæd","1. Ved etablering af primærafgrøde",null,{"$f":"'Hjælpe beregning'!AB40*-1","v":{"$error":"#VALUE!"}},{"$f":"'Hjælpe beregning'!AC40","v":{"$error":"#REF!"}},0,0,0,0,1,1,1,0,3,1,1,1,3,0,1,3,0,null,3,0,29]
[30,"Blanding af olieræddike og fodervikke","1. Vintersæd","1. Ved etablering af primærafgrøde",null,{"$f":"'Hjælpe beregning'!AB41*-1","v":{"$error":"#VALUE!"}},{"$f":"'Hjælpe beregning'!AC41","v":{"$error":"#REF!"}},0,0,0,0,1,1,1,0,0,3,2,1,3,3,3,2,0,null,0,0,30]
[31,"Hvidkløver/alm. rajgræs","1. Vintersæd","1. Ved etablering af primærafgrøde",null,{"$f":"'Hjælpe beregning'!AB42*-1","v":{"$error":"#VALUE!"}},{"$f":"'Hjælpe beregning'!AC42","v":{"$error":"#REF!"}},0,0,0,1,1,1,1,0,3,1,2,1,3,0,1,3,0,null,3,0,31]
[32,"Rødkløver/strandsvingel","1. Vintersæd","1. Ved etablering af primærafgrøde",null,{"$f":"'Hjælpe beregning'!AB43*-1","v":{"$error":"#VALUE!"}},{"$f":"'Hjælpe beregning'!AC43","v":{"$error":"#REF!"}},0,0,0,1,1,1,1,0,1,0,1,1,3,0,1,3,0,null,3,0,32]
[33,"Vintervikke/vinterrug","1. Vintersæd","1. Ved etablering af primærafgrøde",null,{"$f":"'Hjælpe beregning'!AB44*-1","v":{"$error":"#VALUE!"}},{"$f":"'Hjælpe beregning'!AC44","v":{"$error":"#REF!"}},0,0,0,0,1,1,1,0,0,0,3,1,3,0,3,3,0,null,3,0,33]
[34,"Kløvergræs","1. Vintersæd","1. Ved etablering af primærafgrøde",null,{"$f":"'Hjælpe beregning'!AB45*-1","v":{"$error":"#VALUE!"}},{"$f":"'Hjælpe beregning'!AC45","v":{"$error":"#REF!"}},0,0,0,1,1,1,1,0,3,1,3,1,3,0,1,3,0,null,3,0,34]
[]
[]
[]
[null,null,"Ugyldig"]

{"sheet":"1. Anders","index":5,"n_rows":65,"n_cols":5,"rows_kept":65,"cut":false,"hidden":true,"merged":[]}
["Return"]
[null,"Dyrkningsvejledning for efterafgrøde Anders"]
[]
[null,null,"I Vintersæd"]
[]
[null,null,null,"Etablering ved tidlig udlæg"]
[null,null,null,null,"dgsdfh dfghdfhdfhdfghjdfgjfgjfghjfghdfhsdh dfh df hdfgh dfgh d"]
[null,null,null,null,"dfh dfgh dfghjdfklghj fjhlkæsdfjhskldjg sdgj sdkfgj klsdjfgklsdj fgsd gkl"]
[null,null,null,null,"fh dfh dfh fhdfgh dfghdfgh dfhdfghd fgh"]
[]
[null,null,null,null,"dfhdfghdfghfgh dfgh dfgh d"]
[]
[null,null,null,"Etablering før høst"]
[null,null,null,null,"dgsdfh dfghdfhdfhdfghjdfgjfgjfghjfghdfhsdh dfh df hdfgh dfgh d"]
[null,null,null,null,"dfh dfgh dfghjdfklghj fjhlkæsdfjhskldjg sdgj sdkfgj klsdjfgklsdj fgsd gkl"]
[null,null,null,null,"fh dfh dfh fhdfgh dfghdfgh dfhdfghd fgh"]
[]
[null,null,null,null,"dfhdfghdfghfgh dfgh dfgh d"]
[]
[null,null,null,"Etablering efter høst"]
[null,null,null,null,"dgsdfh dfghdfhdfhdfghjdfgjfgjfghjfghdfhsdh dfh df hdfgh dfgh d"]
[null,null,null,null,"dfh dfgh dfghjdfklghj fjhlkæsdfjhskldjg sdgj sdkfgj klsdjfgklsdj fgsd gkl"]
[null,null,null,null,"fh dfh dfh fhdfgh dfghdfgh dfhdfghd fgh"]
[]
[null,null,null,null,"dfhdfghdfghfgh dfgh dfgh d"]
[]
[null,null,"I Vårsæd"]
[]
[null,null,null,"Etablering ved tidlig udlæg"]
[null,null,null,null,"dgsdfh dfghdfhdfhdfghjdfgjfgjfghjfghdfhsdh dfh df hdfgh dfgh d"]
[null,null,null,null,"dfh dfgh dfghjdfklghj fjhlkæsdfjhskldjg sdgj sdkfgj klsdjfgklsdj fgsd gkl"]
[null,null,null,null,"fh dfh dfh fhdfgh dfghdfgh dfhdfghd fgh"]
[]
[null,null,null,null,"dfhdfghdfghfgh dfgh dfgh d"]
[]
[]
[null,null,null,"Etablering før høst"]
[null,null,null,null,"dgsdfh dfghdfhdfhdfghjdfgjfgjfghjfghdfhsdh dfh df hdfgh dfgh d"]
[null,null,null,null,"dfh dfgh dfghjdfklghj fjhlkæsdfjhskldjg sdgj sdkfgj klsdjfgklsdj fgsd gkl"]
[null,null,null,null,"fh dfh dfh fhdfgh dfghdfgh dfhdfghd fgh"]
[]
[null,null,null,null,"dfhdfghdfghfgh dfgh dfgh d"]
[]
[null,null,null,"Etablering efter høst"]
[null,null,null,null,"dgsdfh dfghdfhdfhdfghjdfgjfgjfghjfghdfhsdh dfh df hdfgh dfgh d"]
[null,null,null,null,"dfh dfgh dfghjdfklghj fjhlkæsdfjhskldjg sdgj sdkfgj klsdjfgklsdj fgsd gkl"]
[null,null,null,null,"fh dfh dfh fhdfgh dfghdfgh dfhdfghd fgh"]
[]
[null,null,null,null,"dfhdfghdfghfgh dfgh dfgh d"]
[]
[null,null,"I Majs"]
[]
[null,null,null,"Etablering ved tidlig udlæg"]
[null,null,null,null,"dgsdfh dfghdfhdfhdfghjdfgjfgjfghjfghdfhsdh dfh df hdfgh dfgh d"]
[null,null,null,null,"dfh dfgh dfghjdfklghj fjhlkæsdfjhskldjg sdgj sdkfgj klsdjfgklsdj fgsd gkl"]
[null,null,null,null,"fh dfh dfh fhdfgh dfghdfgh dfhdfghd fgh"]
[]
[null,null,null,null,"dfhdfghdfghfgh dfgh dfgh d"]
[]
[null,null,null,"Etablering efter høst"]
[null,null,null,null,"dgsdfh dfghdfhdfhdfghjdfgjfgjfghjfghdfhsdh dfh df hdfgh dfgh d"]
[null,null,null,null,"dfh dfgh dfghjdfklghj fjhlkæsdfjhskldjg sdgj sdkfgj klsdjfgklsdj fgsd gkl"]
[null,null,null,null,"fh dfh dfh fhdfgh dfghdfgh dfhdfghd fgh"]
[]
[null,null,null,null,"dfhdfghdfghfgh dfgh dfgh d"]

{"sheet":"99. Andre efterafgrøder","index":6,"n_rows":65,"n_cols":5,"rows_kept":65,"cut":false,"hidden":true,"merged":[]}
["Return"]
[null,"Dyrkningsvejledning for øvrige efterafgrøde"]
[]
[null,null,"I Vintersæd"]
[]
[null,null,null,"Etablering ved tidlig udlæg"]
[null,null,null,null,"dgsdfh dfghdfhdfhdfghjdfgjfgjfghjfghdfhsdh dfh df hdfgh dfgh d"]
[null,null,null,null,"dfh dfgh dfghjdfklghj fjhlkæsdfjhskldjg sdgj sdkfgj klsdjfgklsdj fgsd gkl"]
[null,null,null,null,"fh dfh dfh fhdfgh dfghdfgh dfhdfghd fgh"]
[]
[null,null,null,null,"dfhdfghdfghfgh dfgh dfgh d"]
[]
[null,null,null,"Etablering før høst"]
[null,null,null,null,"dgsdfh dfghdfhdfhdfghjdfgjfgjfghjfghdfhsdh dfh df hdfgh dfgh d"]
[null,null,null,null,"dfh dfgh dfghjdfklghj fjhlkæsdfjhskldjg sdgj sdkfgj klsdjfgklsdj fgsd gkl"]
[null,null,null,null,"fh dfh dfh fhdfgh dfghdfgh dfhdfghd fgh"]
[]
[null,null,null,null,"dfhdfghdfghfgh dfgh dfgh d"]
[]
[null,null,null,"Etablering efter høst"]
[null,null,null,null,"dgsdfh dfghdfhdfhdfghjdfgjfgjfghjfghdfhsdh dfh df hdfgh dfgh d"]
[null,null,null,null,"dfh dfgh dfghjdfklghj fjhlkæsdfjhskldjg sdgj sdkfgj klsdjfgklsdj fgsd gkl"]
[null,null,null,null,"fh dfh dfh fhdfgh dfghdfgh dfhdfghd fgh"]
[]
[null,null,null,null,"dfhdfghdfghfgh dfgh dfgh d"]
[]
[null,null,"I Vårsæd"]
[]
[null,null,null,"Etablering ved tidlig udlæg"]
[null,null,null,null,"dgsdfh dfghdfhdfhdfghjdfgjfgjfghjfghdfhsdh dfh df hdfgh dfgh d"]
[null,null,null,null,"dfh dfgh dfghjdfklghj fjhlkæsdfjhskldjg sdgj sdkfgj klsdjfgklsdj fgsd gkl"]
[null,null,null,null,"fh dfh dfh fhdfgh dfghdfgh dfhdfghd fgh"]
[]
[null,null,null,null,"dfhdfghdfghfgh dfgh dfgh d"]
[]
[]
[null,null,null,"Etablering før høst"]
[null,null,null,null,"dgsdfh dfghdfhdfhdfghjdfgjfgjfghjfghdfhsdh dfh df hdfgh dfgh d"]
[null,null,null,null,"dfh dfgh dfghjdfklghj fjhlkæsdfjhskldjg sdgj sdkfgj klsdjfgklsdj fgsd gkl"]
[null,null,null,null,"fh dfh dfh fhdfgh dfghdfgh dfhdfghd fgh"]
[]
[null,null,null,null,"dfhdfghdfghfgh dfgh dfgh d"]
[]
[null,null,null,"Etablering efter høst"]
[null,null,null,null,"dgsdfh dfghdfhdfhdfghjdfgjfgjfghjfghdfhsdh dfh df hdfgh dfgh d"]
[null,null,null,null,"dfh dfgh dfghjdfklghj fjhlkæsdfjhskldjg sdgj sdkfgj klsdjfgklsdj fgsd gkl"]
[null,null,null,null,"fh dfh dfh fhdfgh dfghdfgh dfhdfghd fgh"]
[]
[null,null,null,null,"dfhdfghdfghfgh dfgh dfgh d"]
[]
[null,null,"I Majs"]
[]
[null,null,null,"Etablering ved tidlig udlæg"]
[null,null,null,null,"dgsdfh dfghdfhdfhdfghjdfgjfgjfghjfghdfhsdh dfh df hdfgh dfgh d"]
[null,null,null,null,"dfh dfgh dfghjdfklghj fjhlkæsdfjhskldjg sdgj sdkfgj klsdjfgklsdj fgsd gkl"]
[null,null,null,null,"fh dfh dfh fhdfgh dfghdfgh dfhdfghd fgh"]
[]
[null,null,null,null,"dfhdfghdfghfgh dfgh dfgh d"]
[]
[null,null,null,"Etablering efter høst"]
[null,null,null,null,"dgsdfh dfghdfhdfhdfghjdfgjfgjfghjfghdfhsdh dfh df hdfgh dfgh d"]
[null,null,null,null,"dfh dfgh dfghjdfklghj fjhlkæsdfjhskldjg sdgj sdkfgj klsdjfgklsdj fgsd gkl"]
[null,null,null,null,"fh dfh dfh fhdfgh dfghdfgh dfhdfghd fgh"]
[]
[null,null,null,null,"dfhdfghdfghfgh dfgh dfgh d"]

{"sheet":"Lister","index":7,"n_rows":33,"n_cols":17,"rows_kept":33,"cut":false,"hidden":true,"merged":[]}
[]
[]
["Efterafgrødens funktion"]
["Vælg hvad afgrøden skal bruges som",null,null,null,null,"Karakterliste",null,null,null,null,"Basisvalg",null,null,null,null,"Afgrøde"]
["Pligtig efterafgrøde"]
["Pligtig efterafgrøde og MFO afgrøde",null,null,null,null,"Pris","Ikke vigtigt","Vigtigt","Meget vigtigt",null,"Ja","Nej",null,null,null,"Vælg afgrøde"]
["Kun MFO afgrøde",null,null,null,null,"Dyrkningssikkerhed","Ikke vigtigt","Vigtigt","Meget vigtigt",null,null,null,null,null,null,"1. Vintersæd"]
["Pligtig mellemafgrøde",null,null,null,null,"Stor eftervirkning","Ikke vigtigt","Vigtigt","Meget vigtigt",null,null,null,null,null,null,"2. Vårsæd"]
["Frivillig efterafgrøde",null,null,null,null,"Lovpligtig","Ikke vigtigt","Vigtigt","Meget vigtigt"]
[null,null,null,null,null,"Sygdomme","Ikke vigtigt","Nematoder","Kålbrok","Begge"]
[null,null,null,null,null,"Tiebreak","Ikke vigtigt","Vigtigt","Meget vigtigt",null,null,null,null,null,null,"Etableringstidspunkt"]
[null,null,null,null,null,null,null,null,null,null,null,null,null,null,null,"Vælg tidspunkt","."]
["Afgrøde type",null,null,null,null,null,null,null,null,null,null,null,null,null,null,"Ikke vigtigt",0]
["Vælg hovedafgrøde",null,null,null,null,null,null,null,null,null,null,null,null,null,null,"1. Ved etablering af primærafgrøde",500000]
["Vintersæd",null,null,null,null,"Basis valg",null,null,null,null,null,null,null,null,null,"2. Før høst",500000]
["Vårsæd",null,null,null,null,"Ja",1,null,null,null,null,null,null,null,null,"3. Efter høst",500000]
[null,null,null,null,null,"Nej",0]
["Etableringstidspunkt",null,null,null,null,0,0]
["Vælg etableringstidspunkt"]
["Ved såning af primærafgrøde",null,null,null,null,"Standard karaktere"]
["2-3 uger før høst af primærafgrøde",null,null,null,null,"Ikke vigtigt",0]
["Efter høst af primærafgrøde",null,null,null,null,"Vigtigt",2]
[null,null,null,null,null,"Meget vigtigt",6]
["Jordtype"]
["Vælg jordtype",null,null,null,null,"Ikke vigtigt",0]
["Sand",null,null,null,null,"Foretrækkes",3]
["Ler",null,null,null,null,"Der må ikke opformeres kålbrok",9]
[]
[null,null,null,null,null,"Ikke vigtigt",0]
["Efterfølgende afgrøde",null,null,null,null,"Helst",3]
["Vælg den afgrøde, der følger efter",null,null,null,null,"Egen udsæd skal anvendes ",9]
["Vårsæd"]
[{"$f":"IF(OR('Efterafgrøde beslutningsstøtte'!A7=\"Pligtig mellemafgrøde\"),\"Vintersæd\",\"\")","v":""}]

{"sheet":"Hjælpe beregning","index":8,"n_rows":45,"n_cols":29,"rows_kept":45,"cut":false,"hidden":true,"merged":[[9,11,9,15],[9,16,9,26],[9,27,9,28],[9,8,9,10]]}
[]
[]
[null,"Søjle A= Løbenr"]
[null,"I søjle B, =1 så er der forsøgsresultater mv ellers ikke",null,null,"Forsøgsresultat",null,null,"0=findes ikke, 1=der er forsøgsresultater",null,null,"1=Vintersæd"]
[null,"Søjle C - nr. på afgrøden 1-34",null,null,"Afgrøde efter efterafgrøde",null,null,"1=vintersæd, 2=vårsæd"]
[null,"Søjle E - kode for om den afgrøde der følger efter er vår- eller vintersæd",null,null,"Såtidspunkt",null,null,"1=sammen med afgrøde, 2=før høst, 3=efter høst"]
[null,"Søjle F - kode for såtidspunkt - med foregående afrøder, før eller efter høst",null,null,"Jordbund",null,null,"1=sandjord, 2= lerjord"]
[null,"Søjel G - kode for jordbund"]
[null,"Søjle H - kode for hvor værdier skal findes i normer"]
[null,null,null,null,null,null,null,null,"Udbytte",null,null,"Stykomkostninger",null,null,null,null,"Maskin- og arbejdsomkostninger",null,null,null,null,null,null,null,null,null,null,"Resultat"]
["Lbnr","Forsøgsresultater","Afgrødenr",null,"Afgrøde efter efterafgrøde","Såtidspunkt","Jordbund","Kode for valg af tabel","Merudbytte, hkg. pr. ha","Pris merudbytte","Værdi merudbytte","Kg udsæd","Pris udsæd","Andre omk.","Pris andre omk.","I alt stykomkostninger","Såning antal","Pris såning","Høst, hkg.","Pris mejetærskning","Tørring","Pris tørring","Nedmuldning","Pris nedmuldning","Andre kapa omk.","Pris andre kapa","I alt maskiner og arbejde","I alt omkostninger","Resultat"]
[1,0,1,"Alm. rajgræs, dipl., udlæg1)",{"$f":"IF('Efterafgrøde beslutningsstøtte'!A$19=\"Vintersæd\",1,IF('Efterafgrøde beslutningsstøtte'!A$19=\"Vårsæd\",2,\"Fejl\"))","v":"Fejl"},{"$f":"IF('Efterafgrøde beslutningsstøtte'!A$13=\"Ved såning af primærafgrøde\",1,IF('Efterafgrøde beslutningsstøtte'!A$13=\"2-3 uger før høst af primærafgrøde\",2,IF('Efterafgrøde beslutningsstøtte'!A$13=\"Efter høst af primærafgrøde\",3,\"Fejl\")))","v":"Fejl"},{"$f":"IF('Efterafgrøde beslutningsstøtte'!A$16=\"Sand\",1,IF('Efterafgrøde beslutningsstøtte'!A$16=\"Ler\",2,\"Fejl\"))","v":"Fejl"},{"$f":"(G12-1)*6+(E12-1)*3+F12+2","v":{"$error":"#VALUE!"}},{"$f":"VLOOKUP(C12,Norm!$B$19:$Y$52,H12,FALSE)","v":{"$error":"#REF!"}},{"$f":"IF(E12=1,Norm!$D$9,Norm!$D$10)","v":110},{"$f":"I12*J12","v":{"$error":"#REF!"}},{"$f":"VLOOKUP(C12,Norm!$B$19:$Y$52,14+F12,FALSE)","v":{"$error":"#VALUE!"}},{"$f":"VLOOKUP($C12,Norm!$B$19:$Y$52,18)","v":40},{"$f":"VLOOKUP($C12,Norm!$B$19:$Y$52,19)","v":0},{"$f":"VLOOKUP($C12,Norm!$B$19:$Y$52,20)","v":0},{"$f":"L12*M12+N12*O12","v":{"$error":"#VALUE!"}},1,{"$f":"IF(F12=1,Norm!$D$3,IF(F12=2,Norm!$D$4,IF(F12=3,Norm!$D$5)))","v":false},{"$f":"I12","v":{"$error":"#REF!"}},{"$f":"Norm!$D$12","v":7},{"$f":"S12","v":{"$error":"#REF!"}},{"$f":"Norm!$D$7","v":10},{"$f":"VLOOKUP($C12,Norm!$B$19:$Y$52,23)","v":0},{"$f":"VLOOKUP($C12,Norm!$B$19:$Y$52,24)","v":0},{"$f":"VLOOKUP($C12,Norm!$B$19:$Y$52,21)","v":0},{"$f":"VLOOKUP($C12,Norm!$B$19:$Y$52,22)","v":0},{"$f":"Q12*R12+S12*T12+U12*V12+W12*X12+Y12*Z12","v":{"$error":"#REF!"}},{"$f":"P12+AA12","v":{"$error":"#VALUE!"}},{"$f":"IF(K12>0,K12-AB12,\"-\")","v":{"$error":"#REF!"}}]
[2,0,2,"Ital. rajgræs, dipl., udlæg1)",{"$f":"IF('Efterafgrøde beslutningsstøtte'!A$19=\"Vintersæd\",1,IF('Efterafgrøde beslutningsstøtte'!A$19=\"Vårsæd\",2,\"Fejl\"))","v":"Fejl"},{"$f":"IF('Efterafgrøde beslutningsstøtte'!A$13=\"Ved såning af primærafgrøde\",1,IF('Efterafgrøde beslutningsstøtte'!A$13=\"2-3 uger før høst af primærafgrøde\",2,IF('Efterafgrøde beslutningsstøtte'!A$13=\"Efter høst af primærafgrøde\",3,\"Fejl\")))","v":"Fejl"},{"$f":"IF('Efterafgrøde beslutningsstøtte'!A$16=\"Sand\",1,IF('Efterafgrøde beslutningsstøtte'!A$16=\"Ler\",2,\"Fejl\"))","v":"Fejl"},{"$f":"(G13-1)*6+(E13-1)*3+F13+2","v":{"$error":"#VALUE!"}},{"$f":"VLOOKUP(C13,Norm!$B$19:$Y$52,H13,FALSE)","v":{"$error":"#REF!"}},{"$f":"IF(E13=1,Norm!$D$9,Norm!$D$10)","v":110},{"$f":"I13*J13","v":{"$error":"#REF!"}},{"$f":"VLOOKUP(C13,Norm!$B$19:$Y$52,14+F13,FALSE)","v":{"$error":"#VALUE!"}},{"$f":"VLOOKUP($C13,Norm!$B$19:$Y$52,18)","v":40},{"$f":"VLOOKUP($C13,Norm!$B$19:$Y$52,19)","v":0},{"$f":"VLOOKUP($C13,Norm!$B$19:$Y$52,20)","v":0},{"$f":"L13*M13+N13*O13","v":{"$error":"#VALUE!"}},1,{"$f":"IF(F13=1,Norm!$D$3,IF(F13=2,Norm!$D$4,IF(F13=3,Norm!$D$5)))","v":false},{"$f":"I13","v":{"$error":"#REF!"}},{"$f":"Norm!$D$12","v":7},{"$f":"S13","v":{"$error":"#REF!"}},{"$f":"Norm!$D$7","v":10},{"$f":"VLOOKUP($C13,Norm!$B$19:$Y$52,23)","v":0},{"$f":"VLOOKUP($C13,Norm!$B$19:$Y$52,24)","v":0},{"$f":"VLOOKUP($C13,Norm!$B$19:$Y$52,21)","v":0},{"$f":"VLOOKUP($C13,Norm!$B$19:$Y$52,22)","v":0},{"$f":"Q13*R13+S13*T13+U13*V13+W13*X13+Y13*Z13","v":{"$error":"#REF!"}},{"$f":"P13+AA13","v":{"$error":"#VALUE!"}},{"$f":"IF(K13>0,K13-AB13,\"-\")","v":{"$error":"#REF!"}}]
[3,0,3,"Westerwoldisk rajgræs",{"$f":"IF('Efterafgrøde beslutningsstøtte'!A$19=\"Vintersæd\",1,IF('Efterafgrøde beslutningsstøtte'!A$19=\"Vårsæd\",2,\"Fejl\"))","v":"Fejl"},{"$f":"IF('Efterafgrøde beslutningsstøtte'!A$13=\"Ved såning af primærafgrøde\",1,IF('Efterafgrøde beslutningsstøtte'!A$13=\"2-3 uger før høst af primærafgrøde\",2,IF('Efterafgrøde beslutningsstøtte'!A$13=\"Efter høst af primærafgrøde\",3,\"Fejl\")))","v":"Fejl"},{"$f":"IF('Efterafgrøde beslutningsstøtte'!A$16=\"Sand\",1,IF('Efterafgrøde beslutningsstøtte'!A$16=\"Ler\",2,\"Fejl\"))","v":"Fejl"},{"$error":"#VALUE!"},{"$f":"VLOOKUP(C14,Norm!$B$19:$Y$52,H14,FALSE)","v":{"$error":"#REF!"}},{"$f":"IF(E14=1,Norm!$D$9,Norm!$D$10)","v":110},{"$error":"#REF!"},{"$f":"VLOOKUP(C14,Norm!$B$19:$Y$52,14+F14,FALSE)","v":{"$error":"#VALUE!"}},{"$f":"VLOOKUP($C14,Norm!$B$19:$Y$52,18)","v":40},{"$f":"VLOOKUP($C14,Norm!$B$19:$Y$52,19)","v":0},{"$f":"VLOOKUP($C14,Norm!$B$19:$Y$52,20)","v":0},{"$error":"#VALUE!"},1,{"$f":"IF(F14=1,Norm!$D$3,IF(F14=2,Norm!$D$4,IF(F14=3,Norm!$D$5)))","v":false},{"$error":"#REF!"},{"$f":"Norm!$D$12","v":7},{"$error":"#REF!"},{"$f":"Norm!$D$7","v":10},{"$f":"VLOOKUP($C14,Norm!$B$19:$Y$52,23)","v":0},{"$f":"VLOOKUP($C14,Norm!$B$19:$Y$52,24)","v":0},{"$f":"VLOOKUP($C14,Norm!$B$19:$Y$52,21)","v":0},{"$f":"VLOOKUP($C14,Norm!$B$19:$Y$52,22)","v":0},{"$error":"#REF!"},{"$error":"#VALUE!"},{"$error":"#REF!"}]
[4,0,4,"Strandsvingel, udlæg1)",{"$f":"IF('Efterafgrøde beslutningsstøtte'!A$19=\"Vintersæd\",1,IF('Efterafgrøde beslutningsstøtte'!A$19=\"Vårsæd\",2,\"Fejl\"))","v":"Fejl"},{"$f":"IF('Efterafgrøde beslutningsstøtte'!A$13=\"Ved såning af primærafgrøde\",1,IF('Efterafgrøde beslutningsstøtte'!A$13=\"2-3 uger før høst af primærafgrøde\",2,IF('Efterafgrøde beslutningsstøtte'!A$13=\"Efter høst af primærafgrøde\",3,\"Fejl\")))","v":"Fejl"},{"$f":"IF('Efterafgrøde beslutningsstøtte'!A$16=\"Sand\",1,IF('Efterafgrøde beslutningsstøtte'!A$16=\"Ler\",2,\"Fejl\"))","v":"Fejl"},{"$error":"#VALUE!"},{"$f":"VLOOKUP(C15,Norm!$B$19:$Y$52,H15,FALSE)","v":{"$error":"#REF!"}},{"$f":"IF(E15=1,Norm!$D$9,Norm!$D$10)","v":110},{"$error":"#REF!"},{"$f":"VLOOKUP(C15,Norm!$B$19:$Y$52,14+F15,FALSE)","v":{"$error":"#VALUE!"}},{"$f":"VLOOKUP($C15,Norm!$B$19:$Y$52,18)","v":35},{"$f":"VLOOKUP($C15,Norm!$B$19:$Y$52,19)","v":0},{"$f":"VLOOKUP($C15,Norm!$B$19:$Y$52,20)","v":0},{"$error":"#VALUE!"},1,{"$f":"IF(F15=1,Norm!$D$3,IF(F15=2,Norm!$D$4,IF(F15=3,Norm!$D$5)))","v":false},{"$error":"#REF!"},{"$f":"Norm!$D$12","v":7},{"$error":"#REF!"},{"$f":"Norm!$D$7","v":10},{"$f":"VLOOKUP($C15,Norm!$B$19:$Y$52,23)","v":0},{"$f":"VLOOKUP($C15,Norm!$B$19:$Y$52,24)","v":0},{"$f":"VLOOKUP($C15,Norm!$B$19:$Y$52,21)","v":0},{"$f":"VLOOKUP($C15,Norm!$B$19:$Y$52,22)","v":0},{"$error":"#REF!"},{"$error":"#VALUE!"},{"$error":"#REF!"}]
[5,0,5,"Rødsvingel, udlæg1)",{"$f":"IF('Efterafgrøde beslutningsstøtte'!A$19=\"Vintersæd\",1,IF('Efterafgrøde beslutningsstøtte'!A$19=\"Vårsæd\",2,\"Fejl\"))","v":"Fejl"},{"$f":"IF('Efterafgrøde beslutningsstøtte'!A$13=\"Ved såning af primærafgrøde\",1,IF('Efterafgrøde beslutningsstøtte'!A$13=\"2-3 uger før høst af primærafgrøde\",2,IF('Efterafgrøde beslutningsstøtte'!A$13=\"Efter høst af primærafgrøde\",3,\"Fejl\")))","v":"Fejl"},{"$f":"IF('Efterafgrøde beslutningsstøtte'!A$16=\"Sand\",1,IF('Efterafgrøde beslutningsstøtte'!A$16=\"Ler\",2,\"Fejl\"))","v":"Fejl"},{"$f":"(G16-1)*6+(E16-1)*3+F16+2","v":{"$error":"#VALUE!"}},{"$f":"VLOOKUP(C16,Norm!$B$19:$Y$52,H16,FALSE)","v":{"$error":"#REF!"}},{"$f":"IF(E16=1,Norm!$D$9,Norm!$D$10)","v":110},{"$f":"I16*J16","v":{"$error":"#REF!"}},{"$f":"VLOOKUP(C16,Norm!$B$19:$Y$52,14+F16,FALSE)","v":{"$error":"#VALUE!"}},{"$f":"VLOOKUP($C16,Norm!$B$19:$Y$52,18)","v":40},{"$f":"VLOOKUP($C16,Norm!$B$19:$Y$52,19)","v":0},{"$f":"VLOOKUP($C16,Norm!$B$19:$Y$52,20)","v":0},{"$error":"#VALUE!"},1,{"$f":"IF(F16=1,Norm!$D$3,IF(F16=2,Norm!$D$4,IF(F16=3,Norm!$D$5)))","v":false},{"$error":"#REF!"},{"$f":"Norm!$D$12","v":7},{"$error":"#REF!"},{"$f":"Norm!$D$7","v":10},{"$f":"VLOOKUP($C16,Norm!$B$19:$Y$52,23)","v":0},{"$f":"VLOOKUP($C16,Norm!$B$19:$Y$52,24)","v":0},{"$f":"VLOOKUP($C16,Norm!$B$19:$Y$52,21)","v":0},{"$f":"VLOOKUP($C16,Norm!$B$19:$Y$52,22)","v":0},{"$error":"#REF!"},{"$error":"#VALUE!"},{"$error":"#REF!"}]
[6,0,6,"Engrapgræs, udlæg1)",{"$f":"IF('Efterafgrøde beslutningsstøtte'!A$19=\"Vintersæd\",1,IF('Efterafgrøde beslutningsstøtte'!A$19=\"Vårsæd\",2,\"Fejl\"))","v":"Fejl"},{"$f":"IF('Efterafgrøde beslutningsstøtte'!A$13=\"Ved såning af primærafgrøde\",1,IF('Efterafgrøde beslutningsstøtte'!A$13=\"2-3 uger før høst af primærafgrøde\",2,IF('Efterafgrøde beslutningsstøtte'!A$13=\"Efter høst af primærafgrøde\",3,\"Fejl\")))","v":"Fejl"},{"$f":"IF('Efterafgrøde beslutningsstøtte'!A$16=\"Sand\",1,IF('Efterafgrøde beslutningsstøtte'!A$16=\"Ler\",2,\"Fejl\"))","v":"Fejl"},{"$error":"#VALUE!"},{"$f":"VLOOKUP(C17,Norm!$B$19:$Y$52,H17,FALSE)","v":{"$error":"#REF!"}},{"$f":"IF(E17=1,Norm!$D$9,Norm!$D$10)","v":110},{"$error":"#REF!"},{"$f":"VLOOKUP(C17,Norm!$B$19:$Y$52,14+F17,FALSE)","v":{"$error":"#VALUE!"}},{"$f":"VLOOKUP($C17,Norm!$B$19:$Y$52,18)","v":60},{"$f":"VLOOKUP($C17,Norm!$B$19:$Y$52,19)","v":0},{"$f":"VLOOKUP($C17,Norm!$B$19:$Y$52,20)","v":0},{"$error":"#VALUE!"},1,{"$f":"IF(F17=1,Norm!$D$3,IF(F17=2,Norm!$D$4,IF(F17=3,Norm!$D$5)))","v":false},{"$error":"#REF!"},{"$f":"Norm!$D$12","v":7},{"$error":"#REF!"},{"$f":"Norm!$D$7","v":10},{"$f":"VLOOKUP($C17,Norm!$B$19:$Y$52,23)","v":0},{"$f":"VLOOKUP($C17,Norm!$B$19:$Y$52,24)","v":0},{"$f":"VLOOKUP($C17,Norm!$B$19:$Y$52,21)","v":0},{"$f":"VLOOKUP($C17,Norm!$B$19:$Y$52,22)","v":0},{"$error":"#REF!"},{"$error":"#VALUE!"},{"$error":"#REF!"}]
[7,0,7,"Hundegræs, udlæg1)",{"$f":"IF('Efterafgrøde beslutningsstøtte'!A$19=\"Vintersæd\",1,IF('Efterafgrøde beslutningsstøtte'!A$19=\"Vårsæd\",2,\"Fejl\"))","v":"Fejl"},{"$f":"IF('Efterafgrøde beslutningsstøtte'!A$13=\"Ved såning af primærafgrøde\",1,IF('Efterafgrøde beslutningsstøtte'!A$13=\"2-3 uger før høst af primærafgrøde\",2,IF('Efterafgrøde beslutningsstøtte'!A$13=\"Efter høst af primærafgrøde\",3,\"Fejl\")))","v":"Fejl"},{"$f":"IF('Efterafgrøde beslutningsstøtte'!A$16=\"Sand\",1,IF('Efterafgrøde beslutningsstøtte'!A$16=\"Ler\",2,\"Fejl\"))","v":"Fejl"},{"$error":"#VALUE!"},{"$f":"VLOOKUP(C18,Norm!$B$19:$Y$52,H18,FALSE)","v":{"$error":"#REF!"}},{"$f":"IF(E18=1,Norm!$D$9,Norm!$D$10)","v":110},{"$f":"I18*J18","v":{"$error":"#REF!"}},{"$f":"VLOOKUP(C18,Norm!$B$19:$Y$52,14+F18,FALSE)","v":{"$error":"#VALUE!"}},{"$f":"VLOOKUP($C18,Norm!$B$19:$Y$52,18)","v":60},{"$f":"VLOOKUP($C18,Norm!$B$19:$Y$52,19)","v":0},{"$f":"VLOOKUP($C18,Norm!$B$19:$Y$52,20)","v":0},{"$error":"#VALUE!"},1,{"$f":"IF(F18=1,Norm!$D$3,IF(F18=2,Norm!$D$4,IF(F18=3,Norm!$D$5)))","v":false},{"$error":"#REF!"},{"$f":"Norm!$D$12","v":7},{"$error":"#REF!"},{"$f":"Norm!$D$7","v":10},{"$f":"VLOOKUP($C18,Norm!$B$19:$Y$52,23)","v":0},{"$f":"VLOOKUP($C18,Norm!$B$19:$Y$52,24)","v":0},{"$f":"VLOOKUP($C18,Norm!$B$19:$Y$52,21)","v":0},{"$f":"VLOOKUP($C18,Norm!$B$19:$Y$52,22)","v":0},{"$error":"#REF!"},{"$error":"#VALUE!"},{"$error":"#REF!"}]
[8,0,8,"Frøgræs, udtjent",{"$f":"IF('Efterafgrøde beslutningsstøtte'!A$19=\"Vintersæd\",1,IF('Efterafgrøde beslutningsstøtte'!A$19=\"Vårsæd\",2,\"Fejl\"))","v":"Fejl"},{"$f":"IF('Efterafgrøde beslutningsstøtte'!A$13=\"Ved såning af primærafgrøde\",1,IF('Efterafgrøde beslutningsstøtte'!A$13=\"2-3 uger før høst af primærafgrøde\",2,IF('Efterafgrøde beslutningsstøtte'!A$13=\"Efter høst af primærafgrøde\",3,\"Fejl\")))","v":"Fejl"},{"$f":"IF('Efterafgrøde beslutningsstøtte'!A$16=\"Sand\",1,IF('Efterafgrøde beslutningsstøtte'!A$16=\"Ler\",2,\"Fejl\"))","v":"Fejl"},{"$error":"#VALUE!"},{"$f":"VLOOKUP(C19,Norm!$B$19:$Y$52,H19,FALSE)","v":{"$error":"#REF!"}},{"$f":"IF(E19=1,Norm!$D$9,Norm!$D$10)","v":110},{"$f":"I19*J19","v":{"$error":"#REF!"}},{"$f":"VLOOKUP(C19,Norm!$B$19:$Y$52,14+F19,FALSE)","v":{"$error":"#VALUE!"}},{"$f":"VLOOKUP($C19,Norm!$B$19:$Y$52,18)","v":30},{"$f":"VLOOKUP($C19,Norm!$B$19:$Y$52,19)","v":0},{"$f":"VLOOKUP($C19,Norm!$B$19:$Y$52,20)","v":0},{"$error":"#VALUE!"},1,{"$f":"IF(F19=1,Norm!$D$3,IF(F19=2,Norm!$D$4,IF(F19=3,Norm!$D$5)))","v":false},{"$error":"#REF!"},{"$f":"Norm!$D$12","v":7},{"$error":"#REF!"},{"$f":"Norm!$D$7","v":10},{"$f":"VLOOKUP($C19,Norm!$B$19:$Y$52,23)","v":0},{"$f":"VLOOKUP($C19,Norm!$B$19:$Y$52,24)","v":0},{"$f":"VLOOKUP($C19,Norm!$B$19:$Y$52,21)","v":0},{"$f":"VLOOKUP($C19,Norm!$B$19:$Y$52,22)","v":0},{"$error":"#REF!"},{"$error":"#VALUE!"},{"$error":"#REF!"}]
[9,0,9,"Gul sennep",{"$f":"IF('Efterafgrøde beslutningsstøtte'!A$19=\"Vintersæd\",1,IF('Efterafgrøde beslutningsstøtte'!A$19=\"Vårsæd\",2,\"Fejl\"))","v":"Fejl"},{"$f":"IF('Efterafgrøde beslutningsstøtte'!A$13=\"Ved såning af primærafgrøde\",1,IF('Efterafgrøde beslutningsstøtte'!A$13=\"2-3 uger før høst af primærafgrøde\",2,IF('Efterafgrøde beslutningsstøtte'!A$13=\"Efter høst af primærafgrøde\",3,\"Fejl\")))","v":"Fejl"},{"$f":"IF('Efterafgrøde beslutningsstøtte'!A$16=\"Sand\",1,IF('Efterafgrøde beslutningsstøtte'!A$16=\"Ler\",2,\"Fejl\"))","v":"Fejl"},{"$error":"#VALUE!"},{"$f":"VLOOKUP(C20,Norm!$B$19:$Y$52,H20,FALSE)","v":{"$error":"#REF!"}},{"$f":"IF(E20=1,Norm!$D$9,Norm!$D$10)","v":110},{"$error":"#REF!"},{"$f":"VLOOKUP(C20,Norm!$B$19:$Y$52,14+F20,FALSE)","v":{"$error":"#VALUE!"}},{"$f":"VLOOKUP($C20,Norm!$B$19:$Y$52,18)","v":90},{"$f":"VLOOKUP($C20,Norm!$B$19:$Y$52,19)","v":0},{"$f":"VLOOKUP($C20,Norm!$B$19:$Y$52,20)","v":0},{"$error":"#VALUE!"},1,{"$f":"IF(F20=1,Norm!$D$3,IF(F20=2,Norm!$D$4,IF(F20=3,Norm!$D$5)))","v":false},{"$error":"#REF!"},{"$f":"Norm!$D$12","v":7},{"$error":"#REF!"},{"$f":"Norm!$D$7","v":10},{"$f":"VLOOKUP($C20,Norm!$B$19:$Y$52,23)","v":0},{"$f":"VLOOKUP($C20,Norm!$B$19:$Y$52,24)","v":0},{"$f":"VLOOKUP($C20,Norm!$B$19:$Y$52,21)","v":0},{"$f":"VLOOKUP($C20,Norm!$B$19:$Y$52,22)","v":0},{"$error":"#REF!"},{"$error":"#VALUE!"},{"$error":"#REF!"}]
[10,0,10,"Olieræddike",{"$f":"IF('Efterafgrøde beslutningsstøtte'!A$19=\"Vintersæd\",1,IF('Efterafgrøde beslutningsstøtte'!A$19=\"Vårsæd\",2,\"Fejl\"))","v":"Fejl"},{"$f":"IF('Efterafgrøde beslutningsstøtte'!A$13=\"Ved såning af primærafgrøde\",1,IF('Efterafgrøde beslutningsstøtte'!A$13=\"2-3 uger før høst af primærafgrøde\",2,IF('Efterafgrøde beslutningsstøtte'!A$13=\"Efter høst af primærafgrøde\",3,\"Fejl\")))","v":"Fejl"},{"$f":"IF('Efterafgrøde beslutningsstøtte'!A$16=\"Sand\",1,IF('Efterafgrøde beslutningsstøtte'!A$16=\"Ler\",2,\"Fejl\"))","v":"Fejl"},{"$error":"#VALUE!"},{"$f":"VLOOKUP(C21,Norm!$B$19:$Y$52,H21,FALSE)","v":{"$error":"#REF!"}},{"$f":"IF(E21=1,Norm!$D$9,Norm!$D$10)","v":110},{"$error":"#REF!"},{"$f":"VLOOKUP(C21,Norm!$B$19:$Y$52,14+F21,FALSE)","v":{"$error":"#VALUE!"}},{"$f":"VLOOKUP($C21,Norm!$B$19:$Y$52,18)","v":25},{"$f":"VLOOKUP($C21,Norm!$B$19:$Y$52,19)","v":0},{"$f":"VLOOKUP($C21,Norm!$B$19:$Y$52,20)","v":0},{"$error":"#VALUE!"},1,{"$f":"IF(F21=1,Norm!$D$3,IF(F21=2,Norm!$D$4,IF(F21=3,Norm!$D$5)))","v":false},{"$error":"#REF!"},{"$f":"Norm!$D$12","v":7},{"$error":"#REF!"},{"$f":"Norm!$D$7","v":10},{"$f":"VLOOKUP($C21,Norm!$B$19:$Y$52,23)","v":0},{"$f":"VLOOKUP($C21,Norm!$B$19:$Y$52,24)","v":0},{"$f":"VLOOKUP($C21,Norm!$B$19:$Y$52,21)","v":0},{"$f":"VLOOKUP($C21,Norm!$B$19:$Y$52,22)","v":0},{"$error":"#REF!"},{"$error":"#VALUE!"},{"$error":"#REF!"}]
[11,0,11,"Vinterraps, hybrid",{"$f":"IF('Efterafgrøde beslutningsstøtte'!A$19=\"Vintersæd\",1,IF('Efterafgrøde beslutningsstøtte'!A$19=\"Vårsæd\",2,\"Fejl\"))","v":"Fejl"},{"$f":"IF('Efterafgrøde beslutningsstøtte'!A$13=\"Ved såning af primærafgrøde\",1,IF('Efterafgrøde beslutningsstøtte'!A$13=\"2-3 uger før høst af primærafgrøde\",2,IF('Efterafgrøde beslutningsstøtte'!A$13=\"Efter høst af primærafgrøde\",3,\"Fejl\")))","v":"Fejl"},{"$f":"IF('Efterafgrøde beslutningsstøtte'!A$16=\"Sand\",1,IF('Efterafgrøde beslutningsstøtte'!A$16=\"Ler\",2,\"Fejl\"))","v":"Fejl"},{"$error":"#VALUE!"},{"$f":"VLOOKUP(C22,Norm!$B$19:$Y$52,H22,FALSE)","v":{"$error":"#REF!"}},{"$f":"IF(E22=1,Norm!$D$9,Norm!$D$10)","v":110},{"$error":"#REF!"},{"$f":"VLOOKUP(C22,Norm!$B$19:$Y$52,14+F22,FALSE)","v":{"$error":"#VALUE!"}},{"$f":"VLOOKUP($C22,Norm!$B$19:$Y$52,18)","v":90},{"$f":"VLOOKUP($C22,Norm!$B$19:$Y$52,19)","v":0},{"$f":"VLOOKUP($C22,Norm!$B$19:$Y$52,20)","v":0},{"$error":"#VALUE!"},1,{"$f":"IF(F22=1,Norm!$D$3,IF(F22=2,Norm!$D$4,IF(F22=3,Norm!$D$5)))","v":false},{"$error":"#REF!"},{"$f":"Norm!$D$12","v":7},{"$error":"#REF!"},{"$f":"Norm!$D$7","v":10},{"$f":"VLOOKUP($C22,Norm!$B$19:$Y$52,23)","v":0},{"$f":"VLOOKUP($C22,Norm!$B$19:$Y$52,24)","v":0},{"$f":"VLOOKUP($C22,Norm!$B$19:$Y$52,21)","v":0},{"$f":"VLOOKUP($C22,Norm!$B$19:$Y$52,22)","v":0},{"$error":"#REF!"},{"$error":"#VALUE!"},{"$error":"#REF!"}]
[12,0,12,"Vinterraps , linie",{"$f":"IF('Efterafgrøde beslutningsstøtte'!A$19=\"Vintersæd\",1,IF('Efterafgrøde beslutningsstøtte'!A$19=\"Vårsæd\",2,\"Fejl\"))","v":"Fejl"},{"$f":"IF('Efterafgrøde beslutningsstøtte'!A$13=\"Ved såning af primærafgrøde\",1,IF('Efterafgrøde beslutningsstøtte'!A$13=\"2-3 uger før høst af primærafgrøde\",2,IF('Efterafgrøde beslutningsstøtte'!A$13=\"Efter høst af primærafgrøde\",3,\"Fejl\")))","v":"Fejl"},{"$f":"IF('Efterafgrøde beslutningsstøtte'!A$16=\"Sand\",1,IF('Efterafgrøde beslutningsstøtte'!A$16=\"Ler\",2,\"Fejl\"))","v":"Fejl"},{"$error":"#VALUE!"},{"$f":"VLOOKUP(C23,Norm!$B$19:$Y$52,H23,FALSE)","v":{"$error":"#REF!"}},{"$f":"IF(E23=1,Norm!$D$9,Norm!$D$10)","v":110},{"$error":"#REF!"},{"$f":"VLOOKUP(C23,Norm!$B$19:$Y$52,14+F23,FALSE)","v":{"$error":"#VALUE!"}},{"$f":"VLOOKUP($C23,Norm!$B$19:$Y$52,18)","v":80},{"$f":"VLOOKUP($C23,Norm!$B$19:$Y$52,19)","v":0},{"$f":"VLOOKUP($C23,Norm!$B$19:$Y$52,20)","v":0},{"$error":"#VALUE!"},1,{"$f":"IF(F23=1,Norm!$D$3,IF(F23=2,Norm!$D$4,IF(F23=3,Norm!$D$5)))","v":false},{"$error":"#REF!"},{"$f":"Norm!$D$12","v":7},{"$error":"#REF!"},{"$f":"Norm!$D$7","v":10},{"$f":"VLOOKUP($C23,Norm!$B$19:$Y$52,23)","v":0},{"$f":"VLOOKUP($C23,Norm!$B$19:$Y$52,24)","v":0},{"$f":"VLOOKUP($C23,Norm!$B$19:$Y$52,21)","v":0},{"$f":"VLOOKUP($C23,Norm!$B$19:$Y$52,22)","v":0},{"$error":"#REF!"},{"$error":"#VALUE!"},{"$error":"#REF!"}]
[13,0,13,"Foderradise (Strukturator)",{"$f":"IF('Efterafgrøde beslutningsstøtte'!A$19=\"Vintersæd\",1,IF('Efterafgrøde beslutningsstøtte'!A$19=\"Vårsæd\",2,\"Fejl\"))","v":"Fejl"},{"$f":"IF('Efterafgrøde beslutningsstøtte'!A$13=\"Ved såning af primærafgrøde\",1,IF('Efterafgrøde beslutningsstøtte'!A$13=\"2-3 uger før høst af primærafgrøde\",2,IF('Efterafgrøde beslutningsstøtte'!A$13=\"Efter høst af primærafgrøde\",3,\"Fejl\")))","v":"Fejl"},{"$f":"IF('Efterafgrøde beslutningsstøtte'!A$16=\"Sand\",1,IF('Efterafgrøde beslutningsstøtte'!A$16=\"Ler\",2,\"Fejl\"))","v":"Fejl"},{"$error":"#VALUE!"},{"$f":"VLOOKUP(C24,Norm!$B$19:$Y$52,H24,FALSE)","v":{"$error":"#REF!"}},{"$f":"IF(E24=1,Norm!$D$9,Norm!$D$10)","v":110},{"$error":"#REF!"},{"$f":"VLOOKUP(C24,Norm!$B$19:$Y$52,14+F24,FALSE)","v":{"$error":"#VALUE!"}},{"$f":"VLOOKUP($C24,Norm!$B$19:$Y$52,18)","v":70},{"$f":"VLOOKUP($C24,Norm!$B$19:$Y$52,19)","v":0},{"$f":"VLOOKUP($C24,Norm!$B$19:$Y$52,20)","v":0},{"$error":"#VALUE!"},1,{"$f":"IF(F24=1,Norm!$D$3,IF(F24=2,Norm!$D$4,IF(F24=3,Norm!$D$5)))","v":false},{"$error":"#REF!"},{"$f":"Norm!$D$12","v":7},{"$error":"#REF!"},{"$f":"Norm!$D$7","v":10},{"$f":"VLOOKUP($C24,Norm!$B$19:$Y$52,23)","v":0},{"$f":"VLOOKUP($C24,Norm!$B$19:$Y$52,24)","v":0},{"$f":"VLOOKUP($C24,Norm!$B$19:$Y$52,21)","v":0},{"$f":"VLOOKUP($C24,Norm!$B$19:$Y$52,22)","v":0},{"$error":"#REF!"},{"$error":"#VALUE!"},{"$error":"#REF!"}]
[14,0,14,"Havre, sået inden 1. august",{"$f":"IF('Efterafgrøde beslutningsstøtte'!A$19=\"Vintersæd\",1,IF('Efterafgrøde beslutningsstøtte'!A$19=\"Vårsæd\",2,\"Fejl\"))","v":"Fejl"},{"$f":"IF('Efterafgrøde beslutningsstøtte'!A$13=\"Ved såning af primærafgrøde\",1,IF('Efterafgrøde beslutningsstøtte'!A$13=\"2-3 uger før høst af primærafgrøde\",2,IF('Efterafgrøde beslutningsstøtte'!A$13=\"Efter høst af primærafgrøde\",3,\"Fejl\")))","v":"Fejl"},{"$f":"IF('Efterafgrøde beslutningsstøtte'!A$16=\"Sand\",1,IF('Efterafgrøde beslutningsstøtte'!A$16=\"Ler\",2,\"Fejl\"))","v":"Fejl"},{"$error":"#VALUE!"},{"$f":"VLOOKUP(C25,Norm!$B$19:$Y$52,H25,FALSE)","v":{"$error":"#REF!"}},{"$f":"IF(E25=1,Norm!$D$9,Norm!$D$10)","v":110},{"$error":"#REF!"},{"$f":"VLOOKUP(C25,Norm!$B$19:$Y$52,14+F25,FALSE)","v":{"$error":"#VALUE!"}},{"$f":"VLOOKUP($C25,Norm!$B$19:$Y$52,18)","v":2.85},{"$f":"VLOOKUP($C25,Norm!$B$19:$Y$52,19)","v":0},{"$f":"VLOOKUP($C25,Norm!$B$19:$Y$52,20)","v":0},{"$error":"#VALUE!"},1,{"$f":"IF(F25=1,Norm!$D$3,IF(F25=2,Norm!$D$4,IF(F25=3,Norm!$D$5)))","v":false},{"$error":"#REF!"},{"$f":"Norm!$D$12","v":7},{"$error":"#REF!"},{"$f":"Norm!$D$7","v":10},{"$f":"VLOOKUP($C25,Norm!$B$19:$Y$52,23)","v":0},{"$f":"VLOOKUP($C25,Norm!$B$19:$Y$52,24)","v":0},{"$f":"VLOOKUP($C25,Norm!$B$19:$Y$52,21)","v":0},{"$f":"VLOOKUP($C25,Norm!$B$19:$Y$52,22)","v":0},{"$error":"#REF!"},{"$error":"#VALUE!"},{"$error":"#REF!"}]
[15,0,15,"Havre, sået mellem 1. og 20. august",{"$f":"IF('Efterafgrøde beslutningsstøtte'!A$19=\"Vintersæd\",1,IF('Efterafgrøde beslutningsstøtte'!A$19=\"Vårsæd\",2,\"Fejl\"))","v":"Fejl"},{"$f":"IF('Efterafgrøde beslutningsstøtte'!A$13=\"Ved såning af primærafgrøde\",1,IF('Efterafgrøde beslutningsstøtte'!A$13=\"2-3 uger før høst af primærafgrøde\",2,IF('Efterafgrøde beslutningsstøtte'!A$13=\"Efter høst af primærafgrøde\",3,\"Fejl\")))","v":"Fejl"},{"$f":"IF('Efterafgrøde beslutningsstøtte'!A$16=\"Sand\",1,IF('Efterafgrøde beslutningsstøtte'!A$16=\"Ler\",2,\"Fejl\"))","v":"Fejl"},{"$error":"#VALUE!"},{"$f":"VLOOKUP(C26,Norm!$B$19:$Y$52,H26,FALSE)","v":{"$error":"#REF!"}},{"$f":"IF(E26=1,Norm!$D$9,Norm!$D$10)","v":110},{"$error":"#REF!"},{"$f":"VLOOKUP(C26,Norm!$B$19:$Y$52,14+F26,FALSE)","v":{"$error":"#VALUE!"}},{"$f":"VLOOKUP($C26,Norm!$B$19:$Y$52,18)","v":2.85},{"$f":"VLOOKUP($C26,Norm!$B$19:$Y$52,19)","v":0},{"$f":"VLOOKUP($C26,Norm!$B$19:$Y$52,20)","v":0},{"$error":"#VALUE!"},1,{"$f":"IF(F26=1,Norm!$D$3,IF(F26=2,Norm!$D$4,IF(F26=3,Norm!$D$5)))","v":false},{"$error":"#REF!"},{"$f":"Norm!$D$12","v":7},{"$error":"#REF!"},{"$f":"Norm!$D$7","v":10},{"$f":"VLOOKUP($C26,Norm!$B$19:$Y$52,23)","v":0},{"$f":"VLOOKUP($C26,Norm!$B$19:$Y$52,24)","v":0},{"$f":"VLOOKUP($C26,Norm!$B$19:$Y$52,21)","v":0},{"$f":"VLOOKUP($C26,Norm!$B$19:$Y$52,22)","v":0},{"$error":"#REF!"},{"$error":"#VALUE!"},{"$error":"#REF!"}]
[16,0,16,"Stauderug, sået inden 1. august",{"$f":"IF('Efterafgrøde beslutningsstøtte'!A$19=\"Vintersæd\",1,IF('Efterafgrøde beslutningsstøtte'!A$19=\"Vårsæd\",2,\"Fejl\"))","v":"Fejl"},{"$f":"IF('Efterafgrøde beslutningsstøtte'!A$13=\"Ved såning af primærafgrøde\",1,IF('Efterafgrøde beslutningsstøtte'!A$13=\"2-3 uger før høst af primærafgrøde\",2,IF('Efterafgrøde beslutningsstøtte'!A$13=\"Efter høst af primærafgrøde\",3,\"Fejl\")))","v":"Fejl"},{"$f":"IF('Efterafgrøde beslutningsstøtte'!A$16=\"Sand\",1,IF('Efterafgrøde beslutningsstøtte'!A$16=\"Ler\",2,\"Fejl\"))","v":"Fejl"},{"$error":"#VALUE!"},{"$f":"VLOOKUP(C27,Norm!$B$19:$Y$52,H27,FALSE)","v":{"$error":"#REF!"}},{"$f":"IF(E27=1,Norm!$D$9,Norm!$D$10)","v":110},{"$error":"#REF!"},{"$f":"VLOOKUP(C27,Norm!$B$19:$Y$52,14+F27,FALSE)","v":{"$error":"#VALUE!"}},{"$f":"VLOOKUP($C27,Norm!$B$19:$Y$52,18)","v":4},{"$f":"VLOOKUP($C27,Norm!$B$19:$Y$52,19)","v":0},{"$f":"VLOOKUP($C27,Norm!$B$19:$Y$52,20)","v":0},{"$error":"#VALUE!"},1,{"$f":"IF(F27=1,Norm!$D$3,IF(F27=2,Norm!$D$4,IF(F27=3,Norm!$D$5)))","v":false},{"$error":"#REF!"},{"$f":"Norm!$D$12","v":7},{"$error":"#REF!"},{"$f":"Norm!$D$7","v":10},{"$f":"VLOOKUP($C27,Norm!$B$19:$Y$52,23)","v":0},{"$f":"VLOOKUP($C27,Norm!$B$19:$Y$52,24)","v":0},{"$f":"VLOOKUP($C27,Norm!$B$19:$Y$52,21)","v":0},{"$f":"VLOOKUP($C27,Norm!$B$19:$Y$52,22)","v":0},{"$error":"#REF!"},{"$error":"#VALUE!"},{"$error":"#REF!"}]
[17,0,17,"Stauderug, sået mellem 1. og 20. august",{"$f":"IF('Efterafgrøde beslutningsstøtte'!A$19=\"Vintersæd\",1,IF('Efterafgrøde beslutningsstøtte'!A$19=\"Vårsæd\",2,\"Fejl\"))","v":"Fejl"},{"$f":"IF('Efterafgrøde beslutningsstøtte'!A$13=\"Ved såning af primærafgrøde\",1,IF('Efterafgrøde beslutningsstøtte'!A$13=\"2-3 uger før høst af primærafgrøde\",2,IF('Efterafgrøde beslutningsstøtte'!A$13=\"Efter høst af primærafgrøde\",3,\"Fejl\")))","v":"Fejl"},{"$f":"IF('Efterafgrøde beslutningsstøtte'!A$16=\"Sand\",1,IF('Efterafgrøde beslutningsstøtte'!A$16=\"Ler\",2,\"Fejl\"))","v":"Fejl"},{"$error":"#VALUE!"},{"$f":"VLOOKUP(C28,Norm!$B$19:$Y$52,H28,FALSE)","v":{"$error":"#REF!"}},{"$f":"IF(E28=1,Norm!$D$9,Norm!$D$10)","v":110},{"$error":"#REF!"},{"$f":"VLOOKUP(C28,Norm!$B$19:$Y$52,14+F28,FALSE)","v":{"$error":"#VALUE!"}},{"$f":"VLOOKUP($C28,Norm!$B$19:$Y$52,18)","v":4},{"$f":"VLOOKUP($C28,Norm!$B$19:$Y$52,19)","v":0},{"$f":"VLOOKUP($C28,Norm!$B$19:$Y$52,20)","v":0},{"$error":"#VALUE!"},1,{"$f":"IF(F28=1,Norm!$D$3,IF(F28=2,Norm!$D$4,IF(F28=3,Norm!$D$5)))","v":false},{"$error":"#REF!"},{"$f":"Norm!$D$12","v":7},{"$error":"#REF!"},{"$f":"Norm!$D$7","v":10},{"$f":"VLOOKUP($C28,Norm!$B$19:$Y$52,23)","v":0},{"$f":"VLOOKUP($C28,Norm!$B$19:$Y$52,24)","v":0},{"$f":"VLOOKUP($C28,Norm!$B$19:$Y$52,21)","v":0},{"$f":"VLOOKUP($C28,Norm!$B$19:$Y$52,22)","v":0},{"$error":"#REF!"},{"$error":"#VALUE!"},{"$error":"#REF!"}]
[18,0,18,"Vårbyg, sået inden 1. august",{"$f":"IF('Efterafgrøde beslutningsstøtte'!A$19=\"Vintersæd\",1,IF('Efterafgrøde beslutningsstøtte'!A$19=\"Vårsæd\",2,\"Fejl\"))","v":"Fejl"},{"$f":"IF('Efterafgrøde beslutningsstøtte'!A$13=\"Ved såning af primærafgrøde\",1,IF('Efterafgrøde beslutningsstøtte'!A$13=\"2-3 uger før høst af primærafgrøde\",2,IF('Efterafgrøde beslutningsstøtte'!A$13=\"Efter høst af primærafgrøde\",3,\"Fejl\")))","v":"Fejl"},{"$f":"IF('Efterafgrøde beslutningsstøtte'!A$16=\"Sand\",1,IF('Efterafgrøde beslutningsstøtte'!A$16=\"Ler\",2,\"Fejl\"))","v":"Fejl"},{"$error":"#VALUE!"},{"$f":"VLOOKUP(C29,Norm!$B$19:$Y$52,H29,FALSE)","v":{"$error":"#REF!"}},{"$f":"IF(E29=1,Norm!$D$9,Norm!$D$10)","v":110},{"$error":"#REF!"},{"$f":"VLOOKUP(C29,Norm!$B$19:$Y$52,14+F29,FALSE)","v":{"$error":"#VALUE!"}},{"$f":"VLOOKUP($C29,Norm!$B$19:$Y$52,18)","v":2.7},{"$f":"VLOOKUP($C29,Norm!$B$19:$Y$52,19)","v":0},{"$f":"VLOOKUP($C29,Norm!$B$19:$Y$52,20)","v":0},{"$error":"#VALUE!"},1,{"$f":"IF(F29=1,Norm!$D$3,IF(F29=2,Norm!$D$4,IF(F29=3,Norm!$D$5)))","v":false},{"$error":"#REF!"},{"$f":"Norm!$D$12","v":7},{"$error":"#REF!"},{"$f":"Norm!$D$7","v":10},{"$f":"VLOOKUP($C29,Norm!$B$19:$Y$52,23)","v":0},{"$f":"VLOOKUP($C29,Norm!$B$19:$Y$52,24)","v":0},{"$f":"VLOOKUP($C29,Norm!$B$19:$Y$52,21)","v":0},{"$f":"VLOOKUP($C29,Norm!$B$19:$Y$52,22)","v":0},{"$error":"#REF!"},{"$error":"#VALUE!"},{"$error":"#REF!"}]
[19,0,19,"Vårbyg, sået mellem 1. og 20. august",{"$f":"IF('Efterafgrøde beslutningsstøtte'!A$19=\"Vintersæd\",1,IF('Efterafgrøde beslutningsstøtte'!A$19=\"Vårsæd\",2,\"Fejl\"))","v":"Fejl"},{"$f":"IF('Efterafgrøde beslutningsstøtte'!A$13=\"Ved såning af primærafgrøde\",1,IF('Efterafgrøde beslutningsstøtte'!A$13=\"2-3 uger før høst af primærafgrøde\",2,IF('Efterafgrøde beslutningsstøtte'!A$13=\"Efter høst af primærafgrøde\",3,\"Fejl\")))","v":"Fejl"},{"$f":"IF('Efterafgrøde beslutningsstøtte'!A$16=\"Sand\",1,IF('Efterafgrøde beslutningsstøtte'!A$16=\"Ler\",2,\"Fejl\"))","v":"Fejl"},{"$error":"#VALUE!"},{"$f":"VLOOKUP(C30,Norm!$B$19:$Y$52,H30,FALSE)","v":{"$error":"#REF!"}},{"$f":"IF(E30=1,Norm!$D$9,Norm!$D$10)","v":110},{"$error":"#REF!"},{"$f":"VLOOKUP(C30,Norm!$B$19:$Y$52,14+F30,FALSE)","v":{"$error":"#VALUE!"}},{"$f":"VLOOKUP($C30,Norm!$B$19:$Y$52,18)","v":2.7},{"$f":"VLOOKUP($C30,Norm!$B$19:$Y$52,19)","v":0},{"$f":"VLOOKUP($C30,Norm!$B$19:$Y$52,20)","v":0},{"$error":"#VALUE!"},1,{"$f":"IF(F30=1,Norm!$D$3,IF(F30=2,Norm!$D$4,IF(F30=3,Norm!$D$5)))","v":false},{"$error":"#REF!"},{"$f":"Norm!$D$12","v":7},{"$error":"#REF!"},{"$f":"Norm!$D$7","v":10},{"$f":"VLOOKUP($C30,Norm!$B$19:$Y$52,23)","v":0},{"$f":"VLOOKUP($C30,Norm!$B$19:$Y$52,24)","v":0},{"$f":"VLOOKUP($C30,Norm!$B$19:$Y$52,21)","v":0},{"$f":"VLOOKUP($C30,Norm!$B$19:$Y$52,22)","v":0},{"$error":"#REF!"},{"$error":"#VALUE!"},{"$error":"#REF!"}]
[20,0,20,"Vinterrug (population), sået inden 1. august",{"$f":"IF('Efterafgrøde beslutningsstøtte'!A$19=\"Vintersæd\",1,IF('Efterafgrøde beslutningsstøtte'!A$19=\"Vårsæd\",2,\"Fejl\"))","v":"Fejl"},{"$f":"IF('Efterafgrøde beslutningsstøtte'!A$13=\"Ved såning af primærafgrøde\",1,IF('Efterafgrøde beslutningsstøtte'!A$13=\"2-3 uger før høst af primærafgrøde\",2,IF('Efterafgrøde beslutningsstøtte'!A$13=\"Efter høst af primærafgrøde\",3,\"Fejl\")))","v":"Fejl"},{"$f":"IF('Efterafgrøde beslutningsstøtte'!A$16=\"Sand\",1,IF('Efterafgrøde beslutningsstøtte'!A$16=\"Ler\",2,\"Fejl\"))","v":"Fejl"},{"$error":"#VALUE!"},{"$f":"VLOOKUP(C31,Norm!$B$19:$Y$52,H31,FALSE)","v":{"$error":"#REF!"}},{"$f":"IF(E31=1,Norm!$D$9,Norm!$D$10)","v":110},{"$error":"#REF!"},{"$f":"VLOOKUP(C31,Norm!$B$19:$Y$52,14+F31,FALSE)","v":{"$error":"#VALUE!"}},{"$f":"VLOOKUP($C31,Norm!$B$19:$Y$52,18)","v":4},{"$f":"VLOOKUP($C31,Norm!$B$19:$Y$52,19)","v":0},{"$f":"VLOOKUP($C31,Norm!$B$19:$Y$52,20)","v":0},{"$error":"#VALUE!"},1,{"$f":"IF(F31=1,Norm!$D$3,IF(F31=2,Norm!$D$4,IF(F31=3,Norm!$D$5)))","v":false},{"$error":"#REF!"},{"$f":"Norm!$D$12","v":7},{"$error":"#REF!"},{"$f":"Norm!$D$7","v":10},{"$f":"VLOOKUP($C31,Norm!$B$19:$Y$52,23)","v":0},{"$f":"VLOOKUP($C31,Norm!$B$19:$Y$52,24)","v":0},{"$f":"VLOOKUP($C31,Norm!$B$19:$Y$52,21)","v":0},{"$f":"VLOOKUP($C31,Norm!$B$19:$Y$52,22)","v":0},{"$error":"#REF!"},{"$error":"#VALUE!"},{"$error":"#REF!"}]
[21,0,21,"Vinterrug (population), sået inden 20. august",{"$f":"IF('Efterafgrøde beslutningsstøtte'!A$19=\"Vintersæd\",1,IF('Efterafgrøde beslutningsstøtte'!A$19=\"Vårsæd\",2,\"Fejl\"))","v":"Fejl"},{"$f":"IF('Efterafgrøde beslutningsstøtte'!A$13=\"Ved såning af primærafgrøde\",1,IF('Efterafgrøde beslutningsstøtte'!A$13=\"2-3 uger før høst af primærafgrøde\",2,IF('Efterafgrøde beslutningsstøtte'!A$13=\"Efter høst af primærafgrøde\",3,\"Fejl\")))","v":"Fejl"},{"$f":"IF('Efterafgrøde beslutningsstøtte'!A$16=\"Sand\",1,IF('Efterafgrøde beslutningsstøtte'!A$16=\"Ler\",2,\"Fejl\"))","v":"Fejl"},{"$error":"#VALUE!"},{"$f":"VLOOKUP(C32,Norm!$B$19:$Y$52,H32,FALSE)","v":{"$error":"#REF!"}},{"$f":"IF(E32=1,Norm!$D$9,Norm!$D$10)","v":110},{"$error":"#REF!"},{"$f":"VLOOKUP(C32,Norm!$B$19:$Y$52,14+F32,FALSE)","v":{"$error":"#VALUE!"}},{"$f":"VLOOKUP($C32,Norm!$B$19:$Y$52,18)","v":4},{"$f":"VLOOKUP($C32,Norm!$B$19:$Y$52,19)","v":0},{"$f":"VLOOKUP($C32,Norm!$B$19:$Y$52,20)","v":0},{"$error":"#VALUE!"},1,{"$f":"IF(F32=1,Norm!$D$3,IF(F32=2,Norm!$D$4,IF(F32=3,Norm!$D$5)))","v":false},{"$error":"#REF!"},{"$f":"Norm!$D$12","v":7},{"$error":"#REF!"},{"$f":"Norm!$D$7","v":10},{"$f":"VLOOKUP($C32,Norm!$B$19:$Y$52,23)","v":0},{"$f":"VLOOKUP($C32,Norm!$B$19:$Y$52,24)","v":0},{"$f":"VLOOKUP($C32,Norm!$B$19:$Y$52,21)","v":0},{"$f":"VLOOKUP($C32,Norm!$B$19:$Y$52,22)","v":0},{"$error":"#REF!"},{"$error":"#VALUE!"},{"$error":"#REF!"}]
[22,0,22,"Vinterrug (hybrid og syntetisk), sået inden 1. august",{"$f":"IF('Efterafgrøde beslutningsstøtte'!A$19=\"Vintersæd\",1,IF('Efterafgrøde beslutningsstøtte'!A$19=\"Vårsæd\",2,\"Fejl\"))","v":"Fejl"},{"$f":"IF('Efterafgrøde beslutningsstøtte'!A$13=\"Ved såning af primærafgrøde\",1,IF('Efterafgrøde beslutningsstøtte'!A$13=\"2-3 uger før høst af primærafgrøde\",2,IF('Efterafgrøde beslutningsstøtte'!A$13=\"Efter høst af primærafgrøde\",3,\"Fejl\")))","v":"Fejl"},{"$f":"IF('Efterafgrøde beslutningsstøtte'!A$16=\"Sand\",1,IF('Efterafgrøde beslutningsstøtte'!A$16=\"Ler\",2,\"Fejl\"))","v":"Fejl"},{"$error":"#VALUE!"},{"$f":"VLOOKUP(C33,Norm!$B$19:$Y$52,H33,FALSE)","v":{"$error":"#REF!"}},{"$f":"IF(E33=1,Norm!$D$9,Norm!$D$10)","v":110},{"$error":"#REF!"},{"$f":"VLOOKUP(C33,Norm!$B$19:$Y$52,14+F33,FALSE)","v":{"$error":"#VALUE!"}},{"$f":"VLOOKUP($C33,Norm!$B$19:$Y$52,18)","v":9},{"$f":"VLOOKUP($C33,Norm!$B$19:$Y$52,19)","v":0},{"$f":"VLOOKUP($C33,Norm!$B$19:$Y$52,20)","v":0},{"$error":"#VALUE!"},1,{"$f":"IF(F33=1,Norm!$D$3,IF(F33=2,Norm!$D$4,IF(F33=3,Norm!$D$5)))","v":false},{"$error":"#REF!"},{"$f":"Norm!$D$12","v":7},{"$error":"#REF!"},{"$f":"Norm!$D$7","v":10},{"$f":"VLOOKUP($C33,Norm!$B$19:$Y$52,23)","v":0},{"$f":"VLOOKUP($C33,Norm!$B$19:$Y$52,24)","v":0},{"$f":"VLOOKUP($C33,Norm!$B$19:$Y$52,21)","v":0},{"$f":"VLOOKUP($C33,Norm!$B$19:$Y$52,22)","v":0},{"$error":"#REF!"},{"$error":"#VALUE!"},{"$error":"#REF!"}]
[23,0,23,"Vinterrug (hybrid og syntetisk), sået inden 20. august",{"$f":"IF('Efterafgrøde beslutningsstøtte'!A$19=\"Vintersæd\",1,IF('Efterafgrøde beslutningsstøtte'!A$19=\"Vårsæd\",2,\"Fejl\"))","v":"Fejl"},{"$f":"IF('Efterafgrøde beslutningsstøtte'!A$13=\"Ved såning af primærafgrøde\",1,IF('Efterafgrøde beslutningsstøtte'!A$13=\"2-3 uger før høst af primærafgrøde\",2,IF('Efterafgrøde beslutningsstøtte'!A$13=\"Efter høst af primærafgrøde\",3,\"Fejl\")))","v":"Fejl"},{"$f":"IF('Efterafgrøde beslutningsstøtte'!A$16=\"Sand\",1,IF('Efterafgrøde beslutningsstøtte'!A$16=\"Ler\",2,\"Fejl\"))","v":"Fejl"},{"$error":"#VALUE!"},{"$f":"VLOOKUP(C34,Norm!$B$19:$Y$52,H34,FALSE)","v":{"$error":"#REF!"}},{"$f":"IF(E34=1,Norm!$D$9,Norm!$D$10)","v":110},{"$error":"#REF!"},{"$f":"VLOOKUP(C34,Norm!$B$19:$Y$52,14+F34,FALSE)","v":{"$error":"#VALUE!"}},{"$f":"VLOOKUP($C34,Norm!$B$19:$Y$52,18)","v":9},{"$f":"VLOOKUP($C34,Norm!$B$19:$Y$52,19)","v":0},{"$f":"VLOOKUP($C34,Norm!$B$19:$Y$52,20)","v":0},{"$error":"#VALUE!"},1,{"$f":"IF(F34=1,Norm!$D$3,IF(F34=2,Norm!$D$4,IF(F34=3,Norm!$D$5)))","v":false},{"$error":"#REF!"},{"$f":"Norm!$D$12","v":7},{"$error":"#REF!"},{"$f":"Norm!$D$7","v":10},{"$f":"VLOOKUP($C34,Norm!$B$19:$Y$52,23)","v":0},{"$f":"VLOOKUP($C34,Norm!$B$19:$Y$52,24)","v":0},{"$f":"VLOOKUP($C34,Norm!$B$19:$Y$52,21)","v":0},{"$f":"VLOOKUP($C34,Norm!$B$19:$Y$52,22)","v":0},{"$error":"#REF!"},{"$error":"#VALUE!"},{"$error":"#REF!"}]
[24,0,24,"Cikorie",{"$f":"IF('Efterafgrøde beslutningsstøtte'!A$19=\"Vintersæd\",1,IF('Efterafgrøde beslutningsstøtte'!A$19=\"Vårsæd\",2,\"Fejl\"))","v":"Fejl"},{"$f":"IF('Efterafgrøde beslutningsstøtte'!A$13=\"Ved såning af primærafgrøde\",1,IF('Efterafgrøde beslutningsstøtte'!A$13=\"2-3 uger før høst af primærafgrøde\",2,IF('Efterafgrøde beslutningsstøtte'!A$13=\"Efter høst af primærafgrøde\",3,\"Fejl\")))","v":"Fejl"},{"$f":"IF('Efterafgrøde beslutningsstøtte'!A$16=\"Sand\",1,IF('Efterafgrøde beslutningsstøtte'!A$16=\"Ler\",2,\"Fejl\"))","v":"Fejl"},{"$error":"#VALUE!"},{"$f":"VLOOKUP(C35,Norm!$B$19:$Y$52,H35,FALSE)","v":{"$error":"#REF!"}},{"$f":"IF(E35=1,Norm!$D$9,Norm!$D$10)","v":110},{"$error":"#REF!"},{"$f":"VLOOKUP(C35,Norm!$B$19:$Y$52,14+F35,FALSE)","v":{"$error":"#VALUE!"}},{"$f":"VLOOKUP($C35,Norm!$B$19:$Y$52,18)","v":70},{"$f":"VLOOKUP($C35,Norm!$B$19:$Y$52,19)","v":0},{"$f":"VLOOKUP($C35,Norm!$B$19:$Y$52,20)","v":0},{"$error":"#VALUE!"},1,{"$f":"IF(F35=1,Norm!$D$3,IF(F35=2,Norm!$D$4,IF(F35=3,Norm!$D$5)))","v":false},{"$error":"#REF!"},{"$f":"Norm!$D$12","v":7},{"$error":"#REF!"},{"$f":"Norm!$D$7","v":10},{"$f":"VLOOKUP($C35,Norm!$B$19:$Y$52,23)","v":0},{"$f":"VLOOKUP($C35,Norm!$B$19:$Y$52,24)","v":0},{"$f":"VLOOKUP($C35,Norm!$B$19:$Y$52,21)","v":0},{"$f":"VLOOKUP($C35,Norm!$B$19:$Y$52,22)","v":0},{"$error":"#REF!"},{"$error":"#VALUE!"},{"$error":"#REF!"}]
[25,0,25,"Honningurt",{"$f":"IF('Efterafgrøde beslutningsstøtte'!A$19=\"Vintersæd\",1,IF('Efterafgrøde beslutningsstøtte'!A$19=\"Vårsæd\",2,\"Fejl\"))","v":"Fejl"},{"$f":"IF('Efterafgrøde beslutningsstøtte'!A$13=\"Ved såning af primærafgrøde\",1,IF('Efterafgrøde beslutningsstøtte'!A$13=\"2-3 uger før høst af primærafgrøde\",2,IF('Efterafgrøde beslutningsstøtte'!A$13=\"Efter høst af primærafgrøde\",3,\"Fejl\")))","v":"Fejl"},{"$f":"IF('Efterafgrøde beslutningsstøtte'!A$16=\"Sand\",1,IF('Efterafgrøde beslutningsstøtte'!A$16=\"Ler\",2,\"Fejl\"))","v":"Fejl"},{"$error":"#VALUE!"},{"$f":"VLOOKUP(C36,Norm!$B$19:$Y$52,H36,FALSE)","v":{"$error":"#REF!"}},{"$f":"IF(E36=1,Norm!$D$9,Norm!$D$10)","v":110},{"$error":"#REF!"},{"$f":"VLOOKUP(C36,Norm!$B$19:$Y$52,14+F36,FALSE)","v":{"$error":"#VALUE!"}},{"$f":"VLOOKUP($C36,Norm!$B$19:$Y$52,18)","v":40},{"$f":"VLOOKUP($C36,Norm!$B$19:$Y$52,19)","v":0},{"$f":"VLOOKUP($C36,Norm!$B$19:$Y$52,20)","v":0},{"$error":"#VALUE!"},1,{"$f":"IF(F36=1,Norm!$D$3,IF(F36=2,Norm!$D$4,IF(F36=3,Norm!$D$5)))","v":false},{"$error":"#REF!"},{"$f":"Norm!$D$12","v":7},{"$error":"#REF!"},{"$f":"Norm!$D$7","v":10},{"$f":"VLOOKUP($C36,Norm!$B$19:$Y$52,23)","v":0},{"$f":"VLOOKUP($C36,Norm!$B$19:$Y$52,24)","v":0},{"$f":"VLOOKUP($C36,Norm!$B$19:$Y$52,21)","v":0},{"$f":"VLOOKUP($C36,Norm!$B$19:$Y$52,22)","v":0},{"$error":"#REF!"},{"$error":"#VALUE!"},{"$error":"#REF!"}]
[26,0,26,"Fodervikke ",{"$f":"IF('Efterafgrøde beslutningsstøtte'!A$19=\"Vintersæd\",1,IF('Efterafgrøde beslutningsstøtte'!A$19=\"Vårsæd\",2,\"Fejl\"))","v":"Fejl"},{"$f":"IF('Efterafgrøde beslutningsstøtte'!A$13=\"Ved såning af primærafgrøde\",1,IF('Efterafgrøde beslutningsstøtte'!A$13=\"2-3 uger før høst af primærafgrøde\",2,IF('Efterafgrøde beslutningsstøtte'!A$13=\"Efter høst af primærafgrøde\",3,\"Fejl\")))","v":"Fejl"},{"$f":"IF('Efterafgrøde beslutningsstøtte'!A$16=\"Sand\",1,IF('Efterafgrøde beslutningsstøtte'!A$16=\"Ler\",2,\"Fejl\"))","v":"Fejl"},{"$error":"#VALUE!"},{"$f":"VLOOKUP(C37,Norm!$B$19:$Y$52,H37,FALSE)","v":{"$error":"#REF!"}},{"$f":"IF(E37=1,Norm!$D$9,Norm!$D$10)","v":110},{"$error":"#REF!"},{"$f":"VLOOKUP(C37,Norm!$B$19:$Y$52,14+F37,FALSE)","v":{"$error":"#VALUE!"}},{"$f":"VLOOKUP($C37,Norm!$B$19:$Y$52,18)","v":5},{"$f":"VLOOKUP($C37,Norm!$B$19:$Y$52,19)","v":0},{"$f":"VLOOKUP($C37,Norm!$B$19:$Y$52,20)","v":0},{"$error":"#VALUE!"},1,{"$f":"IF(F37=1,Norm!$D$3,IF(F37=2,Norm!$D$4,IF(F37=3,Norm!$D$5)))","v":false},{"$error":"#REF!"},{"$f":"Norm!$D$12","v":7},{"$error":"#REF!"},{"$f":"Norm!$D$7","v":10},{"$f":"VLOOKUP($C37,Norm!$B$19:$Y$52,23)","v":0},{"$f":"VLOOKUP($C37,Norm!$B$19:$Y$52,24)","v":0},{"$f":"VLOOKUP($C37,Norm!$B$19:$Y$52,21)","v":0},{"$f":"VLOOKUP($C37,Norm!$B$19:$Y$52,22)","v":0},{"$error":"#REF!"},{"$error":"#VALUE!"},{"$error":"#REF!"}]
[27,0,27,"Vintervikke",{"$f":"IF('Efterafgrøde beslutningsstøtte'!A$19=\"Vintersæd\",1,IF('Efterafgrøde beslutningsstøtte'!A$19=\"Vårsæd\",2,\"Fejl\"))","v":"Fejl"},{"$f":"IF('Efterafgrøde beslutningsstøtte'!A$13=\"Ved såning af primærafgrøde\",1,IF('Efterafgrøde beslutningsstøtte'!A$13=\"2-3 uger før høst af primærafgrøde\",2,IF('Efterafgrøde beslutningsstøtte'!A$13=\"Efter høst af primærafgrøde\",3,\"Fejl\")))","v":"Fejl"},{"$f":"IF('Efterafgrøde beslutningsstøtte'!A$16=\"Sand\",1,IF('Efterafgrøde beslutningsstøtte'!A$16=\"Ler\",2,\"Fejl\"))","v":"Fejl"},{"$error":"#VALUE!"},{"$f":"VLOOKUP(C38,Norm!$B$19:$Y$52,H38,FALSE)","v":{"$error":"#REF!"}},{"$f":"IF(E38=1,Norm!$D$9,Norm!$D$10)","v":110},{"$error":"#REF!"},{"$f":"VLOOKUP(C38,Norm!$B$19:$Y$52,14+F38,FALSE)","v":{"$error":"#VALUE!"}},{"$f":"VLOOKUP($C38,Norm!$B$19:$Y$52,18)","v":5},{"$f":"VLOOKUP($C38,Norm!$B$19:$Y$52,19)","v":0},{"$f":"VLOOKUP($C38,Norm!$B$19:$Y$52,20)","v":0},{"$error":"#VALUE!"},1,{"$f":"IF(F38=1,Norm!$D$3,IF(F38=2,Norm!$D$4,IF(F38=3,Norm!$D$5)))","v":false},{"$error":"#REF!"},{"$f":"Norm!$D$12","v":7},{"$error":"#REF!"},{"$f":"Norm!$D$7","v":10},{"$f":"VLOOKUP($C38,Norm!$B$19:$Y$52,23)","v":0},{"$f":"VLOOKUP($C38,Norm!$B$19:$Y$52,24)","v":0},{"$f":"VLOOKUP($C38,Norm!$B$19:$Y$52,21)","v":0},{"$f":"VLOOKUP($C38,Norm!$B$19:$Y$52,22)","v":0},{"$error":"#REF!"},{"$error":"#VALUE!"},{"$error":"#REF!"}]
[28,0,28,"Alexandrinekløver",{"$f":"IF('Efterafgrøde beslutningsstøtte'!A$19=\"Vintersæd\",1,IF('Efterafgrøde beslutningsstøtte'!A$19=\"Vårsæd\",2,\"Fejl\"))","v":"Fejl"},{"$f":"IF('Efterafgrøde beslutningsstøtte'!A$13=\"Ved såning af primærafgrøde\",1,IF('Efterafgrøde beslutningsstøtte'!A$13=\"2-3 uger før høst af primærafgrøde\",2,IF('Efterafgrøde beslutningsstøtte'!A$13=\"Efter høst af primærafgrøde\",3,\"Fejl\")))","v":"Fejl"},{"$f":"IF('Efterafgrøde beslutningsstøtte'!A$16=\"Sand\",1,IF('Efterafgrøde beslutningsstøtte'!A$16=\"Ler\",2,\"Fejl\"))","v":"Fejl"},{"$error":"#VALUE!"},{"$f":"VLOOKUP(C39,Norm!$B$19:$Y$52,H39,FALSE)","v":{"$error":"#REF!"}},{"$f":"IF(E39=1,Norm!$D$9,Norm!$D$10)","v":110},{"$error":"#REF!"},{"$f":"VLOOKUP(C39,Norm!$B$19:$Y$52,14+F39,FALSE)","v":{"$error":"#VALUE!"}},{"$f":"VLOOKUP($C39,Norm!$B$19:$Y$52,18)","v":30},{"$f":"VLOOKUP($C39,Norm!$B$19:$Y$52,19)","v":0},{"$f":"VLOOKUP($C39,Norm!$B$19:$Y$52,20)","v":0},{"$error":"#VALUE!"},1,{"$f":"IF(F39=1,Norm!$D$3,IF(F39=2,Norm!$D$4,IF(F39=3,Norm!$D$5)))","v":false},{"$error":"#REF!"},{"$f":"Norm!$D$12","v":7},{"$error":"#REF!"},{"$f":"Norm!$D$7","v":10},{"$f":"VLOOKUP($C39,Norm!$B$19:$Y$52,23)","v":0},{"$f":"VLOOKUP($C39,Norm!$B$19:$Y$52,24)","v":0},{"$f":"VLOOKUP($C39,Norm!$B$19:$Y$52,21)","v":0},{"$f":"VLOOKUP($C39,Norm!$B$19:$Y$52,22)","v":0},{"$error":"#REF!"},{"$error":"#VALUE!"},{"$error":"#REF!"}]
[29,0,29,"Hvidkløver",{"$f":"IF('Efterafgrøde beslutningsstøtte'!A$19=\"Vintersæd\",1,IF('Efterafgrøde beslutningsstøtte'!A$19=\"Vårsæd\",2,\"Fejl\"))","v":"Fejl"},{"$f":"IF('Efterafgrøde beslutningsstøtte'!A$13=\"Ved såning af primærafgrøde\",1,IF('Efterafgrøde beslutningsstøtte'!A$13=\"2-3 uger før høst af primærafgrøde\",2,IF('Efterafgrøde beslutningsstøtte'!A$13=\"Efter høst af primærafgrøde\",3,\"Fejl\")))","v":"Fejl"},{"$f":"IF('Efterafgrøde beslutningsstøtte'!A$16=\"Sand\",1,IF('Efterafgrøde beslutningsstøtte'!A$16=\"Ler\",2,\"Fejl\"))","v":"Fejl"},{"$error":"#VALUE!"},{"$f":"VLOOKUP(C40,Norm!$B$19:$Y$52,H40,FALSE)","v":{"$error":"#REF!"}},{"$f":"IF(E40=1,Norm!$D$9,Norm!$D$10)","v":110},{"$error":"#REF!"},{"$f":"VLOOKUP(C40,Norm!$B$19:$Y$52,14+F40,FALSE)","v":{"$error":"#VALUE!"}},{"$f":"VLOOKUP($C40,Norm!$B$19:$Y$52,18)","v":90},{"$f":"VLOOKUP($C40,Norm!$B$19:$Y$52,19)","v":0},{"$f":"VLOOKUP($C40,Norm!$B$19:$Y$52,20)","v":0},{"$error":"#VALUE!"},1,{"$f":"IF(F40=1,Norm!$D$3,IF(F40=2,Norm!$D$4,IF(F40=3,Norm!$D$5)))","v":false},{"$error":"#REF!"},{"$f":"Norm!$D$12","v":7},{"$error":"#REF!"},{"$f":"Norm!$D$7","v":10},{"$f":"VLOOKUP($C40,Norm!$B$19:$Y$52,23)","v":0},{"$f":"VLOOKUP($C40,Norm!$B$19:$Y$52,24)","v":0},{"$f":"VLOOKUP($C40,Norm!$B$19:$Y$52,21)","v":0},{"$f":"VLOOKUP($C40,Norm!$B$19:$Y$52,22)","v":0},{"$error":"#REF!"},{"$error":"#VALUE!"},{"$error":"#REF!"}]
[30,0,30,"Blanding af olieræddike og fodervikke",{"$f":"IF('Efterafgrøde beslutningsstøtte'!A$19=\"Vintersæd\",1,IF('Efterafgrøde beslutningsstøtte'!A$19=\"Vårsæd\",2,\"Fejl\"))","v":"Fejl"},{"$f":"IF('Efterafgrøde beslutningsstøtte'!A$13=\"Ved såning af primærafgrøde\",1,IF('Efterafgrøde beslutningsstøtte'!A$13=\"2-3 uger før høst af primærafgrøde\",2,IF('Efterafgrøde beslutningsstøtte'!A$13=\"Efter høst af primærafgrøde\",3,\"Fejl\")))","v":"Fejl"},{"$f":"IF('Efterafgrøde beslutningsstøtte'!A$16=\"Sand\",1,IF('Efterafgrøde beslutningsstøtte'!A$16=\"Ler\",2,\"Fejl\"))","v":"Fejl"},{"$error":"#VALUE!"},{"$f":"VLOOKUP(C41,Norm!$B$19:$Y$52,H41,FALSE)","v":{"$error":"#REF!"}},{"$f":"IF(E41=1,Norm!$D$9,Norm!$D$10)","v":110},{"$error":"#REF!"},{"$f":"VLOOKUP(C41,Norm!$B$19:$Y$52,14+F41,FALSE)","v":{"$error":"#VALUE!"}},{"$f":"VLOOKUP($C41,Norm!$B$19:$Y$52,18)","v":7.45},{"$f":"VLOOKUP($C41,Norm!$B$19:$Y$52,19)","v":0},{"$f":"VLOOKUP($C41,Norm!$B$19:$Y$52,20)","v":0},{"$error":"#VALUE!"},1,{"$f":"IF(F41=1,Norm!$D$3,IF(F41=2,Norm!$D$4,IF(F41=3,Norm!$D$5)))","v":false},{"$error":"#REF!"},{"$f":"Norm!$D$12","v":7},{"$error":"#REF!"},{"$f":"Norm!$D$7","v":10},{"$f":"VLOOKUP($C41,Norm!$B$19:$Y$52,23)","v":0},{"$f":"VLOOKUP($C41,Norm!$B$19:$Y$52,24)","v":0},{"$f":"VLOOKUP($C41,Norm!$B$19:$Y$52,21)","v":0},{"$f":"VLOOKUP($C41,Norm!$B$19:$Y$52,22)","v":0},{"$error":"#REF!"},{"$error":"#VALUE!"},{"$error":"#REF!"}]
[31,0,31,"Hvidkløver/alm. rajgræs",{"$f":"IF('Efterafgrøde beslutningsstøtte'!A$19=\"Vintersæd\",1,IF('Efterafgrøde beslutningsstøtte'!A$19=\"Vårsæd\",2,\"Fejl\"))","v":"Fejl"},{"$f":"IF('Efterafgrøde beslutningsstøtte'!A$13=\"Ved såning af primærafgrøde\",1,IF('Efterafgrøde beslutningsstøtte'!A$13=\"2-3 uger før høst af primærafgrøde\",2,IF('Efterafgrøde beslutningsstøtte'!A$13=\"Efter høst af primærafgrøde\",3,\"Fejl\")))","v":"Fejl"},{"$f":"IF('Efterafgrøde beslutningsstøtte'!A$16=\"Sand\",1,IF('Efterafgrøde beslutningsstøtte'!A$16=\"Ler\",2,\"Fejl\"))","v":"Fejl"},{"$error":"#VALUE!"},{"$f":"VLOOKUP(C42,Norm!$B$19:$Y$52,H42,FALSE)","v":{"$error":"#REF!"}},{"$f":"IF(E42=1,Norm!$D$9,Norm!$D$10)","v":110},{"$error":"#REF!"},{"$f":"VLOOKUP(C42,Norm!$B$19:$Y$52,14+F42,FALSE)","v":{"$error":"#VALUE!"}},{"$f":"VLOOKUP($C42,Norm!$B$19:$Y$52,18)","v":50},{"$f":"VLOOKUP($C42,Norm!$B$19:$Y$52,19)","v":0},{"$f":"VLOOKUP($C42,Norm!$B$19:$Y$52,20)","v":0},{"$error":"#VALUE!"},1,{"$f":"IF(F42=1,Norm!$D$3,IF(F42=2,Norm!$D$4,IF(F42=3,Norm!$D$5)))","v":false},{"$error":"#REF!"},{"$f":"Norm!$D$12","v":7},{"$error":"#REF!"},{"$f":"Norm!$D$7","v":10},{"$f":"VLOOKUP($C42,Norm!$B$19:$Y$52,23)","v":0},{"$f":"VLOOKUP($C42,Norm!$B$19:$Y$52,24)","v":0},{"$f":"VLOOKUP($C42,Norm!$B$19:$Y$52,21)","v":0},{"$f":"VLOOKUP($C42,Norm!$B$19:$Y$52,22)","v":0},{"$error":"#REF!"},{"$error":"#VALUE!"},{"$error":"#REF!"}]
[32,0,32,"Rødkløver/strandsvingel",{"$f":"IF('Efterafgrøde beslutningsstøtte'!A$19=\"Vintersæd\",1,IF('Efterafgrøde beslutningsstøtte'!A$19=\"Vårsæd\",2,\"Fejl\"))","v":"Fejl"},{"$f":"IF('Efterafgrøde beslutningsstøtte'!A$13=\"Ved såning af primærafgrøde\",1,IF('Efterafgrøde beslutningsstøtte'!A$13=\"2-3 uger før høst af primærafgrøde\",2,IF('Efterafgrøde beslutningsstøtte'!A$13=\"Efter høst af primærafgrøde\",3,\"Fejl\")))","v":"Fejl"},{"$f":"IF('Efterafgrøde beslutningsstøtte'!A$16=\"Sand\",1,IF('Efterafgrøde beslutningsstøtte'!A$16=\"Ler\",2,\"Fejl\"))","v":"Fejl"},{"$error":"#VALUE!"},{"$f":"VLOOKUP(C43,Norm!$B$19:$Y$52,H43,FALSE)","v":{"$error":"#REF!"}},{"$f":"IF(E43=1,Norm!$D$9,Norm!$D$10)","v":110},{"$error":"#REF!"},{"$f":"VLOOKUP(C43,Norm!$B$19:$Y$52,14+F43,FALSE)","v":{"$error":"#VALUE!"}},{"$f":"VLOOKUP($C43,Norm!$B$19:$Y$52,18)","v":42},{"$f":"VLOOKUP($C43,Norm!$B$19:$Y$52,19)","v":0},{"$f":"VLOOKUP($C43,Norm!$B$19:$Y$52,20)","v":0},{"$error":"#VALUE!"},1,{"$f":"IF(F43=1,Norm!$D$3,IF(F43=2,Norm!$D$4,IF(F43=3,Norm!$D$5)))","v":false},{"$error":"#REF!"},{"$f":"Norm!$D$12","v":7},{"$error":"#REF!"},{"$f":"Norm!$D$7","v":10},{"$f":"VLOOKUP($C43,Norm!$B$19:$Y$52,23)","v":0},{"$f":"VLOOKUP($C43,Norm!$B$19:$Y$52,24)","v":0},{"$f":"VLOOKUP($C43,Norm!$B$19:$Y$52,21)","v":0},{"$f":"VLOOKUP($C43,Norm!$B$19:$Y$52,22)","v":0},{"$error":"#REF!"},{"$error":"#VALUE!"},{"$error":"#REF!"}]
[33,0,33,"Vintervikke/vinterrug",{"$f":"IF('Efterafgrøde beslutningsstøtte'!A$19=\"Vintersæd\",1,IF('Efterafgrøde beslutningsstøtte'!A$19=\"Vårsæd\",2,\"Fejl\"))","v":"Fejl"},{"$f":"IF('Efterafgrøde beslutningsstøtte'!A$13=\"Ved såning af primærafgrøde\",1,IF('Efterafgrøde beslutningsstøtte'!A$13=\"2-3 uger før høst af primærafgrøde\",2,IF('Efterafgrøde beslutningsstøtte'!A$13=\"Efter høst af primærafgrøde\",3,\"Fejl\")))","v":"Fejl"},{"$f":"IF('Efterafgrøde beslutningsstøtte'!A$16=\"Sand\",1,IF('Efterafgrøde beslutningsstøtte'!A$16=\"Ler\",2,\"Fejl\"))","v":"Fejl"},{"$error":"#VALUE!"},{"$f":"VLOOKUP(C44,Norm!$B$19:$Y$52,H44,FALSE)","v":{"$error":"#REF!"}},{"$f":"IF(E44=1,Norm!$D$9,Norm!$D$10)","v":110},{"$error":"#REF!"},{"$f":"VLOOKUP(C44,Norm!$B$19:$Y$52,14+F44,FALSE)","v":{"$error":"#VALUE!"}},{"$f":"VLOOKUP($C44,Norm!$B$19:$Y$52,18)","v":4.5},{"$f":"VLOOKUP($C44,Norm!$B$19:$Y$52,19)","v":0},{"$f":"VLOOKUP($C44,Norm!$B$19:$Y$52,20)","v":0},{"$error":"#VALUE!"},1,{"$f":"IF(F44=1,Norm!$D$3,IF(F44=2,Norm!$D$4,IF(F44=3,Norm!$D$5)))","v":false},{"$error":"#REF!"},{"$f":"Norm!$D$12","v":7},{"$error":"#REF!"},{"$f":"Norm!$D$7","v":10},{"$f":"VLOOKUP($C44,Norm!$B$19:$Y$52,23)","v":0},{"$f":"VLOOKUP($C44,Norm!$B$19:$Y$52,24)","v":0},{"$f":"VLOOKUP($C44,Norm!$B$19:$Y$52,21)","v":0},{"$f":"VLOOKUP($C44,Norm!$B$19:$Y$52,22)","v":0},{"$error":"#REF!"},{"$error":"#VALUE!"},{"$error":"#REF!"}]
[34,0,34,"Kløvergræs",{"$f":"IF('Efterafgrøde beslutningsstøtte'!A$19=\"Vintersæd\",1,IF('Efterafgrøde beslutningsstøtte'!A$19=\"Vårsæd\",2,\"Fejl\"))","v":"Fejl"},{"$f":"IF('Efterafgrøde beslutningsstøtte'!A$13=\"Ved såning af primærafgrøde\",1,IF('Efterafgrøde beslutningsstøtte'!A$13=\"2-3 uger før høst af primærafgrøde\",2,IF('Efterafgrøde beslutningsstøtte'!A$13=\"Efter høst af primærafgrøde\",3,\"Fejl\")))","v":"Fejl"},{"$f":"IF('Efterafgrøde beslutningsstøtte'!A$16=\"Sand\",1,IF('Efterafgrøde beslutningsstøtte'!A$16=\"Ler\",2,\"Fejl\"))","v":"Fejl"},{"$error":"#VALUE!"},{"$f":"VLOOKUP(C45,Norm!$B$19:$Y$52,H45,FALSE)","v":{"$error":"#REF!"}},{"$f":"IF(E45=1,Norm!$D$9,Norm!$D$10)","v":110},{"$error":"#REF!"},{"$f":"VLOOKUP(C45,Norm!$B$19:$Y$52,14+F45,FALSE)","v":{"$error":"#VALUE!"}},{"$f":"VLOOKUP($C45,Norm!$B$19:$Y$52,18)","v":40},{"$f":"VLOOKUP($C45,Norm!$B$19:$Y$52,19)","v":0},{"$f":"VLOOKUP($C45,Norm!$B$19:$Y$52,20)","v":0},{"$error":"#VALUE!"},1,{"$f":"IF(F45=1,Norm!$D$3,IF(F45=2,Norm!$D$4,IF(F45=3,Norm!$D$5)))","v":false},{"$error":"#REF!"},{"$f":"Norm!$D$12","v":7},{"$error":"#REF!"},{"$f":"Norm!$D$7","v":10},{"$f":"VLOOKUP($C45,Norm!$B$19:$Y$52,23)","v":0},{"$f":"VLOOKUP($C45,Norm!$B$19:$Y$52,24)","v":0},{"$f":"VLOOKUP($C45,Norm!$B$19:$Y$52,21)","v":0},{"$f":"VLOOKUP($C45,Norm!$B$19:$Y$52,22)","v":0},{"$error":"#REF!"},{"$error":"#VALUE!"},{"$error":"#REF!"}]

{"sheet":"Norm","index":9,"n_rows":52,"n_cols":26,"rows_kept":52,"cut":false,"hidden":false,"merged":[[13,3,13,14],[14,3,14,8],[14,9,14,14],[16,19,16,20],[15,3,15,8],[16,3,16,5],[16,6,16,8],[15,23,16,24],[15,21,16,22],[16,15,16,17],[15,9,15,14],[16,9,16,11],[16,12,16,14]]}
[]
[null,null,"Omkostninger såning",null,"Kode"]
[null,null,"Sammen med afgrøden",55,1]
[null,null,"Før høst",75,2]
[null,null,"Efter høst",185,3]
[]
[null,null,"Omkostninger tørring",10,"kr. pr. hkg."]
[]
[null,null,"Pris vintersæd (vinerhvede)",130,"kr. pr. hkg."]
[null,null,"Pris vårsæd (foderbyg)",110,"kr. pr. hkg."]
[null,null,"Mejetærskning - basis",800,"kr. pr ha"]
[null,null,"Mejetærskning - korrektion pr. hkg.",7,"kr. pr. hkg."]
[]
[null,null,null,"Jordbund"]
[null,null,null,"Sandjord",null,null,null,null,null,"Lerjord"]
[null,null,null,"Merudbytte, hkg pr. ha",null,null,null,null,null,"Merudbytte, hkg pr. ha",null,null,null,null,null,null,null,null,null,null,null,"Andre kapacitetsomkostninger",null,"Nedmulding"]
[null,null,"Afgrøde","Vintersæd",null,null,"Vårsæd",null,null,"Vintersæd",null,null,"Vårsæd",null,null,"Udsæd - kg. pr. ha",null,null,null,"Andre stykomk"]
[null,null,"Såtid","Sammen med","Før","Efter","Sammen med","Før","Efter","Sammen med","Før","Efter","Sammen med","Før","Efter","Sammenmed","Før","Efter","Pris","Antal","Pris","Antal","Pris","Antal","Pris"]
[null,1,"Alm. rajgræs, dipl., udlæg1)",0,0,0,3,0,0,0,0,0,1,0,0,8,12,8,40,0,0,0,0,0,0]
[null,2,"Ital. rajgræs, dipl., udlæg1)",0,0,0,3,0,0,0,0,0,1,0,0,6,10,8,40,0,0,0,0,0,0]
[null,3,"Westerwoldisk rajgræs",0,0,0,3,0,0,0,0,0,1,0,0,6,10,8,40,0,0,0,0,0,0]
[null,4,"Strandsvingel, udlæg1)",0,0,0,3,0,0,0,0,0,1,0,0,10,14,12,35,0,0,0,0,0,0]
[null,5,"Rødsvingel, udlæg1)",0,0,0,0,0,0,1,0,0,1,0,0,5,8,6,40,0,0,0,0,0,0]
[null,6,"Engrapgræs, udlæg1)",0,0,0,0,0,0,0,0,0,1,0,0,5,8,6,60,0,0,0,0,0,0]
[null,7,"Hundegræs, udlæg1)",0,0,0,3,0,0,0,0,0,1,0,0,5,8,6,60,0,0,0,0,0,0]
[null,8,"Frøgræs, udtjent",0,0,0,0,0,0,0,0,0,0,0,0,5,8,6,30,0,0,0,0,0,0]
[null,9,"Gul sennep",0,0,0,0,0,0,0,4,4,0,4,4,8,8,6,90,0,0,0,0,0,0]
[null,10,"Olieræddike",0,0,0,0,0,0,0,4,4,0,4,4,14,14,12,25,0,0,0,0,0,0]
[null,11,"Vinterraps, hybrid",0,0,0,0,0,0,0,2,2,0,2,2,8,8,5,90,0,0,0,0,0,0]
[null,12,"Vinterraps , linie",0,0,0,0,0,0,0,2,2,0,2,2,8,8,5,80,0,0,0,0,0,0]
[null,13,"Foderradise (Strukturator)",0,0,0,0,0,0,0,4,4,0,4,4,14,14,12,70,0,0,0,0,0,0]
[null,14,"Havre, sået inden 1. august",0,1,1,0,1,1,0,0,0,0,0,0,180,180,150,2.85,0,0,0,0,0,0]
[null,15,"Havre, sået mellem 1. og 20. august",0,0,0,0,0,0,0,0,0,0,0,0,180,180,150,2.85,0,0,0,0,0,0]
[null,16,"Stauderug, sået inden 1. august",0,1,1,0,1,1,0,0,0,0,0,0,120,120,100,4,0,0,0,0,0,0]
[null,17,"Stauderug, sået mellem 1. og 20. august",0,0,0,0,0,0,0,0,0,0,0,0,120,120,100,4,0,0,0,0,0,0]
[null,18,"Vårbyg, sået inden 1. august",0,1,1,0,1,1,0,0,0,0,0,0,120,120,100,2.7,0,0,0,0,0,0]
[null,19,"Vårbyg, sået mellem 1. og 20. august",0,0,0,0,0,0,0,0,0,0,0,0,120,120,100,2.7,0,0,0,0,0,0]
[null,20,"Vinterrug (population), sået inden 1. august",0,1,1,0,1,1,0,0,0,0,0,0,120,120,100,4,0,0,0,0,0,0]
[null,21,"Vinterrug (population), sået inden 20. august",0,0,0,0,0,0,0,0,0,0,0,0,120,120,100,4,0,0,0,0,0,0]
[null,22,"Vinterrug (hybrid og syntetisk), sået inden 1. august",0,1,1,0,1,1,0,0,0,0,0,0,120,120,100,9,0,0,0,0,0,0]
[null,23,"Vinterrug (hybrid og syntetisk), sået inden 20. august",0,0,0,0,0,0,0,0,0,0,0,0,120,120,100,9,0,0,0,0,0,0]
[null,24,"Cikorie",0,0,0,5,0,0,0,0,0,3,0,0,5,5,5,70,0,0,0,0,0,0]
[null,25,"Honningurt",0,3,3,0,3,3,0,2,2,0,2,2,10,10,8,40,0,0,0,0,0,0]
[null,26,"Fodervikke ",0,6,6,0,6,6,0,10,10,0,10,10,100,100,80,5,0,0,0,0,0,0]
[null,27,"Vintervikke",0,6,6,0,6,6,0,10,10,0,10,10,90,90,75,5,0,0,0,0,0,0]
[null,28,"Alexandrinekløver",0,0,0,0,0,0,0,7,7,0,7,7,12,12,10,30,0,0,0,0,0,0]
[null,29,"Hvidkløver",0,0,0,7,0,0,0,0,0,5,0,0,4,4,4,90,0,0,0,0,0,0]
[null,30,"Blanding af olieræddike og fodervikke",0,5,5,0,5,5,0,8,8,0,8,8,58,58,58,7.45,0,0,0,0,0,0,"8 kg. olieræddike + 50 kg. fodervikke"]
[null,31,"Hvidkløver/alm. rajgræs",0,0,0,5,0,0,0,0,0,5,0,0,10,10,10,50,0,0,0,0,0,0,"2 kg hvidkløver + 8 kg. alm rajgræs"]
[null,32,"Rødkløver/strandsvingel",0,0,0,6,0,0,0,0,0,5,0,0,10,10,10,42,0,0,0,0,0,0,"2 kg. rødkløver + 8 kg. strandsvingel"]
[null,33,"Vintervikke/vinterrug",0,5,5,0,5,5,0,5,5,0,5,5,100,100,80,4.5,0,0,0,0,0,0,"50 kg. vintervikke + 50 kg. vinterrug"]
[null,34,"Kløvergræs",0,0,0,7,0,0,0,0,0,5,0,0,24.5,24.5,24.5,40,0,0,0,0,0,0]

{"sheet":"Basis_norm","index":10,"n_rows":52,"n_cols":26,"rows_kept":52,"cut":false,"hidden":true,"merged":[[15,23,16,24],[16,3,16,5],[16,6,16,8],[16,9,16,11],[16,12,16,14],[16,15,16,17],[16,19,16,20],[13,3,13,14],[14,9,14,14],[15,3,15,8],[15,9,15,14],[15,21,16,22],[14,3,14,8]]}
[]
[null,null,"Omkostninger såning",null,"Kode"]
[null,null,"Sammen med afgrøden",55,1]
[null,null,"Før høst",75,2]
[null,null,"Efter høst",185,3]
[]
[null,null,"Omkostninger tørring",10,"kr. pr. hkg."]
[]
[null,null,"Pris vintersæd (vinerhvede)",130,"kr. pr. hkg."]
[null,null,"Pris vårsæd (foderbyg)",110,"kr. pr. hkg."]
[null,null,"Mejetærskning - basis",800,"kr. pr ha"]
[null,null,"Mejetærskning - korrektion pr. hkg.",7,"kr. pr. hkg."]
[]
[null,null,null,"Jordbund"]
[null,null,null,"Sandjord",null,null,null,null,null,"Lerjord"]
[null,null,null,"Merudbytte, hkg pr. ha",null,null,null,null,null,"Merudbytte, hkg pr. ha",null,null,null,null,null,null,null,null,null,null,null,"Andre kapacitetsomkostninger",null,"Nedmulding"]
[null,null,"Afgrøde","Vintersæd",null,null,"Vårsæd",null,null,"Vintersæd",null,null,"Vårsæd",null,null,"Udsæd - kg. pr. ha",null,null,null,"Andre stykomk"]
[null,null,"Såtid","Sammen med","Før","Efter","Sammen med","Før","Efter","Sammen med","Før","Efter","Sammen med","Før","Efter","Sammenmed","Før","Efter","Pris","Antal","Pris","Antal","Pris","Antal","Pris"]
[null,1,"Alm. rajgræs, dipl., udlæg1)",0,0,0,3,0,0,0,0,0,1,0,0,8,12,8,40,0,0,0,0,0,0]
[null,2,"Ital. rajgræs, dipl., udlæg1)",0,0,0,3,0,0,0,0,0,1,0,0,6,10,8,40,0,0,0,0,0,0]
[null,3,"Westerwoldisk rajgræs",0,0,0,3,0,0,0,0,0,1,0,0,6,10,8,40,0,0,0,0,0,0]
[null,4,"Strandsvingel, udlæg1)",0,0,0,3,0,0,0,0,0,1,0,0,10,14,12,35,0,0,0,0,0,0]
[null,5,"Rødsvingel, udlæg1)",0,0,0,0,0,0,1,0,0,1,0,0,5,8,6,40,0,0,0,0,0,0]
[null,6,"Engrapgræs, udlæg1)",0,0,0,0,0,0,0,0,0,1,0,0,5,8,6,60,0,0,0,0,0,0]
[null,7,"Hundegræs, udlæg1)",0,0,0,3,0,0,0,0,0,1,0,0,5,8,6,60,0,0,0,0,0,0]
[null,8,"Frøgræs, udtjent",0,0,0,0,0,0,0,0,0,0,0,0,5,8,6,30,0,0,0,0,0,0]
[null,9,"Gul sennep",0,0,0,0,0,0,0,4,4,0,4,4,8,8,6,90,0,0,0,0,0,0]
[null,10,"Olieræddike",0,0,0,0,0,0,0,4,4,0,4,4,14,14,12,25,0,0,0,0,0,0]
[null,11,"Vinterraps, hybrid",0,0,0,0,0,0,0,2,2,0,2,2,8,8,5,90,0,0,0,0,0,0]
[null,12,"Vinterraps , linie",0,0,0,0,0,0,0,2,2,0,2,2,8,8,5,80,0,0,0,0,0,0]
[null,13,"Foderradise (Strukturator)",0,0,0,0,0,0,0,4,4,0,4,4,14,14,12,70,0,0,0,0,0,0]
[null,14,"Havre, sået inden 1. august",0,1,1,0,1,1,0,0,0,0,0,0,180,180,150,2.85,0,0,0,0,0,0]
[null,15,"Havre, sået mellem 1. og 20. august",0,0,0,0,0,0,0,0,0,0,0,0,180,180,150,2.85,0,0,0,0,0,0]
[null,16,"Stauderug, sået inden 1. august",0,1,1,0,1,1,0,0,0,0,0,0,120,120,100,4,0,0,0,0,0,0]
[null,17,"Stauderug, sået mellem 1. og 20. august",0,0,0,0,0,0,0,0,0,0,0,0,120,120,100,4,0,0,0,0,0,0]
[null,18,"Vårbyg, sået inden 1. august",0,1,1,0,1,1,0,0,0,0,0,0,120,120,100,2.7,0,0,0,0,0,0]
[null,19,"Vårbyg, sået mellem 1. og 20. august",0,0,0,0,0,0,0,0,0,0,0,0,120,120,100,2.7,0,0,0,0,0,0]
[null,20,"Vinterrug (population), sået inden 1. august",0,1,1,0,1,1,0,0,0,0,0,0,120,120,100,4,0,0,0,0,0,0]
[null,21,"Vinterrug (population), sået inden 20. august",0,0,0,0,0,0,0,0,0,0,0,0,120,120,100,4,0,0,0,0,0,0]
[null,22,"Vinterrug (hybrid og syntetisk), sået inden 1. august",0,1,1,0,1,1,0,0,0,0,0,0,120,120,100,9,0,0,0,0,0,0]
[null,23,"Vinterrug (hybrid og syntetisk), sået inden 20. august",0,0,0,0,0,0,0,0,0,0,0,0,120,120,100,9,0,0,0,0,0,0]
[null,24,"Cikorie",0,0,0,5,0,0,0,0,0,3,0,0,5,5,5,70,0,0,0,0,0,0]
[null,25,"Honningurt",0,3,3,0,3,3,0,2,2,0,2,2,10,10,8,40,0,0,0,0,0,0]
[null,26,"Fodervikke ",0,6,6,0,6,6,0,10,10,0,10,10,100,100,80,5,0,0,0,0,0,0]
[null,27,"Vintervikke",0,6,6,0,6,6,0,10,10,0,10,10,90,90,75,5,0,0,0,0,0,0]
[null,28,"Alexandrinekløver",0,0,0,0,0,0,0,7,7,0,7,7,12,12,10,30,0,0,0,0,0,0]
[null,29,"Hvidkløver",0,0,0,7,0,0,0,0,0,5,0,0,4,4,4,90,0,0,0,0,0,0]
[null,30,"Blanding af olieræddike og fodervikke",0,5,5,0,5,5,0,8,8,0,8,8,58,58,58,7.45,0,0,0,0,0,0,"8 kg. olieræddike + 50 kg. fodervikke"]
[null,31,"Hvidkløver/alm. rajgræs",0,0,0,5,0,0,0,0,0,5,0,0,10,10,10,50,0,0,0,0,0,0,"2 kg hvidkløver + 8 kg. alm rajgræs"]
[null,32,"Rødkløver/strandsvingel",0,0,0,6,0,0,0,0,0,5,0,0,10,10,10,42,0,0,0,0,0,0,"2 kg. rødkløver + 8 kg. strandsvingel"]
[null,33,"Vintervikke/vinterrug",0,5,5,0,5,5,0,5,5,0,5,5,100,100,80,4.5,0,0,0,0,0,0,"50 kg. vintervikke + 50 kg. vinterrug"]
[null,34,"Kløvergræs",0,0,0,7,0,0,0,0,0,5,0,0,24.5,24.5,24.5,40,0,0,0,0,0,0]

{"sheet":"Norm lig basisnorm","index":11,"n_rows":57,"n_cols":25,"rows_kept":57,"cut":false,"hidden":true,"merged":[[16,23,17,24],[17,3,17,5],[17,6,17,8],[17,9,17,11],[17,12,17,14],[17,15,17,17],[17,19,17,20],[16,21,17,22],[14,3,14,14],[15,3,15,8],[15,9,15,14],[16,3,16,8],[16,9,16,14]]}
[]
[]
[null,null,"Omkostninger såning",null,"Kode"]
[null,null,"Sammen med afgrøden",{"$f":"Norm!D3=Basis_norm!D3","v":true},{"$f":"Norm!E3=Basis_norm!E3","v":true}]
[null,null,"Før høst",{"$f":"Norm!D4=Basis_norm!D4","v":true},{"$f":"Norm!E4=Basis_norm!E4","v":true}]
[null,null,"Efter høst",{"$f":"Norm!D5=Basis_norm!D5","v":true},{"$f":"Norm!E5=Basis_norm!E5","v":true}]
[]
[null,null,"Omkostninger tørring",{"$f":"Norm!D7=Basis_norm!D7","v":true},"kr. pr. hkg."]
[]
[null,null,"Pris vintersæd (vinerhvede)",{"$f":"Norm!D9=Basis_norm!D9","v":true},"kr. pr. hkg."]
[null,null,"Pris vårsæd (foderbyg)",{"$f":"Norm!D10=Basis_norm!D10","v":true},"kr. pr. hkg."]
[null,null,"Mejetærskning - basis",{"$f":"Norm!D11=Basis_norm!D11","v":true},"kr. pr ha"]
[null,null,"Mejetærskning - korrektion pr. hkg.",{"$f":"Norm!D12=Basis_norm!D12","v":true},"kr. pr. hkg."]
[]
[null,null,null,"Jordbund"]
[null,null,null,"Sandjord",null,null,null,null,null,"Lerjord"]
[null,null,null,"Merudbytte",null,null,null,null,null,"Merudbytte",null,null,null,null,null,null,null,null,null,null,null,"Andre kapacitetsomkostninger",null,"Nedmulding"]
[null,null,"Afgrøde","Vintersæd",null,null,"Vårsæd",null,null,"Vintersæd",null,null,"Vårsæd",null,null,"Udsæd - kg. pr. ha",null,null,null,"Andre stykomk"]
[null,null,"Såtid","Sammen med","Før","Efter","Sammen med","Før","Efter","Sammen med","Før","Efter","Sammen med","Før","Efter","Sammenmed","Før","Efter","Pris","Antal","Pris","Antal","Pris","Antal","Pris"]
[null,1,"Alm. rajgræs, dipl., udlæg1)",{"$f":"Norm!D19=Basis_norm!D19","v":true},{"$f":"Norm!E19=Basis_norm!E19","v":true},{"$f":"Norm!F19=Basis_norm!F19","v":true},{"$f":"Norm!G19=Basis_norm!G19","v":true},{"$f":"Norm!H19=Basis_norm!H19","v":true},{"$f":"Norm!I19=Basis_norm!I19","v":true},{"$f":"Norm!J19=Basis_norm!J19","v":true},{"$f":"Norm!K19=Basis_norm!K19","v":true},{"$f":"Norm!L19=Basis_norm!L19","v":true},{"$f":"Norm!M19=Basis_norm!M19","v":true},{"$f":"Norm!N19=Basis_norm!N19","v":true},{"$f":"Norm!O19=Basis_norm!O19","v":true},{"$f":"Norm!P19=Basis_norm!P19","v":true},{"$f":"Norm!Q19=Basis_norm!Q19","v":true},{"$f":"Norm!R19=Basis_norm!R19","v":true},{"$f":"Norm!S19=Basis_norm!S19","v":true},{"$f":"Norm!T19=Basis_norm!T19","v":true},{"$f":"Norm!U19=Basis_norm!U19","v":true},{"$f":"Norm!V19=Basis_norm!V19","v":true},{"$f":"Norm!W19=Basis_norm!W19","v":true},{"$f":"Norm!X19=Basis_norm!X19","v":true},{"$f":"Norm!Y19=Basis_norm!Y19","v":true}]
[null,2,"Ital. rajgræs, dipl., udlæg1)",{"$f":"Norm!D20=Basis_norm!D20","v":true},{"$f":"Norm!E20=Basis_norm!E20","v":true},{"$f":"Norm!F20=Basis_norm!F20","v":true},{"$f":"Norm!G20=Basis_norm!G20","v":true},{"$f":"Norm!H20=Basis_norm!H20","v":true},{"$f":"Norm!I20=Basis_norm!I20","v":true},{"$f":"Norm!J20=Basis_norm!J20","v":true},{"$f":"Norm!K20=Basis_norm!K20","v":true},{"$f":"Norm!L20=Basis_norm!L20","v":true},{"$f":"Norm!M20=Basis_norm!M20","v":true},{"$f":"Norm!N20=Basis_norm!N20","v":true},{"$f":"Norm!O20=Basis_norm!O20","v":true},{"$f":"Norm!P20=Basis_norm!P20","v":true},{"$f":"Norm!Q20=Basis_norm!Q20","v":true},{"$f":"Norm!R20=Basis_norm!R20","v":true},{"$f":"Norm!S20=Basis_norm!S20","v":true},{"$f":"Norm!T20=Basis_norm!T20","v":true},{"$f":"Norm!U20=Basis_norm!U20","v":true},{"$f":"Norm!V20=Basis_norm!V20","v":true},{"$f":"Norm!W20=Basis_norm!W20","v":true},{"$f":"Norm!X20=Basis_norm!X20","v":true},{"$f":"Norm!Y20=Basis_norm!Y20","v":true}]
[null,3,"Westerwoldisk rajgræs",{"$f":"Norm!D21=Basis_norm!D21","v":true},{"$f":"Norm!E21=Basis_norm!E21","v":true},{"$f":"Norm!F21=Basis_norm!F21","v":true},{"$f":"Norm!G21=Basis_norm!G21","v":true},{"$f":"Norm!H21=Basis_norm!H21","v":true},{"$f":"Norm!I21=Basis_norm!I21","v":true},{"$f":"Norm!J21=Basis_norm!J21","v":true},{"$f":"Norm!K21=Basis_norm!K21","v":true},{"$f":"Norm!L21=Basis_norm!L21","v":true},{"$f":"Norm!M21=Basis_norm!M21","v":true},{"$f":"Norm!N21=Basis_norm!N21","v":true},{"$f":"Norm!O21=Basis_norm!O21","v":true},{"$f":"Norm!P21=Basis_norm!P21","v":true},{"$f":"Norm!Q21=Basis_norm!Q21","v":true},{"$f":"Norm!R21=Basis_norm!R21","v":true},{"$f":"Norm!S21=Basis_norm!S21","v":true},{"$f":"Norm!T21=Basis_norm!T21","v":true},{"$f":"Norm!U21=Basis_norm!U21","v":true},{"$f":"Norm!V21=Basis_norm!V21","v":true},{"$f":"Norm!W21=Basis_norm!W21","v":true},{"$f":"Norm!X21=Basis_norm!X21","v":true},{"$f":"Norm!Y21=Basis_norm!Y21","v":true}]
[null,4,"Strandsvingel, udlæg1)",{"$f":"Norm!D22=Basis_norm!D22","v":true},{"$f":"Norm!E22=Basis_norm!E22","v":true},{"$f":"Norm!F22=Basis_norm!F22","v":true},{"$f":"Norm!G22=Basis_norm!G22","v":true},{"$f":"Norm!H22=Basis_norm!H22","v":true},{"$f":"Norm!I22=Basis_norm!I22","v":true},{"$f":"Norm!J22=Basis_norm!J22","v":true},{"$f":"Norm!K22=Basis_norm!K22","v":true},{"$f":"Norm!L22=Basis_norm!L22","v":true},{"$f":"Norm!M22=Basis_norm!M22","v":true},{"$f":"Norm!N22=Basis_norm!N22","v":true},{"$f":"Norm!O22=Basis_norm!O22","v":true},{"$f":"Norm!P22=Basis_norm!P22","v":true},{"$f":"Norm!Q22=Basis_norm!Q22","v":true},{"$f":"Norm!R22=Basis_norm!R22","v":true},{"$f":"Norm!S22=Basis_norm!S22","v":true},{"$f":"Norm!T22=Basis_norm!T22","v":true},{"$f":"Norm!U22=Basis_norm!U22","v":true},{"$f":"Norm!V22=Basis_norm!V22","v":true},{"$f":"Norm!W22=Basis_norm!W22","v":true},{"$f":"Norm!X22=Basis_norm!X22","v":true},{"$f":"Norm!Y22=Basis_norm!Y22","v":true}]
[null,5,"Rødsvingel, udlæg1)",{"$f":"Norm!D23=Basis_norm!D23","v":true},{"$f":"Norm!E23=Basis_norm!E23","v":true},{"$f":"Norm!F23=Basis_norm!F23","v":true},{"$f":"Norm!G23=Basis_norm!G23","v":true},{"$f":"Norm!H23=Basis_norm!H23","v":true},{"$f":"Norm!I23=Basis_norm!I23","v":true},{"$f":"Norm!J23=Basis_norm!J23","v":true},{"$f":"Norm!K23=Basis_norm!K23","v":true},{"$f":"Norm!L23=Basis_norm!L23","v":true},{"$f":"Norm!M23=Basis_norm!M23","v":true},{"$f":"Norm!N23=Basis_norm!N23","v":true},{"$f":"Norm!O23=Basis_norm!O23","v":true},{"$f":"Norm!P23=Basis_norm!P23","v":true},{"$f":"Norm!Q23=Basis_norm!Q23","v":true},{"$f":"Norm!R23=Basis_norm!R23","v":true},{"$f":"Norm!S23=Basis_norm!S23","v":true},{"$f":"Norm!T23=Basis_norm!T23","v":true},{"$f":"Norm!U23=Basis_norm!U23","v":true},{"$f":"Norm!V23=Basis_norm!V23","v":true},{"$f":"Norm!W23=Basis_norm!W23","v":true},{"$f":"Norm!X23=Basis_norm!X23","v":true},{"$f":"Norm!Y23=Basis_norm!Y23","v":true}]
[null,6,"Engrapgræs, udlæg1)",{"$f":"Norm!D24=Basis_norm!D24","v":true},{"$f":"Norm!E24=Basis_norm!E24","v":true},{"$f":"Norm!F24=Basis_norm!F24","v":true},{"$f":"Norm!G24=Basis_norm!G24","v":true},{"$f":"Norm!H24=Basis_norm!H24","v":true},{"$f":"Norm!I24=Basis_norm!I24","v":true},{"$f":"Norm!J24=Basis_norm!J24","v":true},{"$f":"Norm!K24=Basis_norm!K24","v":true},{"$f":"Norm!L24=Basis_norm!L24","v":true},{"$f":"Norm!M24=Basis_norm!M24","v":true},{"$f":"Norm!N24=Basis_norm!N24","v":true},{"$f":"Norm!O24=Basis_norm!O24","v":true},{"$f":"Norm!P24=Basis_norm!P24","v":true},{"$f":"Norm!Q24=Basis_norm!Q24","v":true},{"$f":"Norm!R24=Basis_norm!R24","v":true},{"$f":"Norm!S24=Basis_norm!S24","v":true},{"$f":"Norm!T24=Basis_norm!T24","v":true},{"$f":"Norm!U24=Basis_norm!U24","v":true},{"$f":"Norm!V24=Basis_norm!V24","v":true},{"$f":"Norm!W24=Basis_norm!W24","v":true},{"$f":"Norm!X24=Basis_norm!X24","v":true},{"$f":"Norm!Y24=Basis_norm!Y24","v":true}]
[null,7,"Hundegræs, udlæg1)",{"$f":"Norm!D25=Basis_norm!D25","v":true},{"$f":"Norm!E25=Basis_norm!E25","v":true},{"$f":"Norm!F25=Basis_norm!F25","v":true},{"$f":"Norm!G25=Basis_norm!G25","v":true},{"$f":"Norm!H25=Basis_norm!H25","v":true},{"$f":"Norm!I25=Basis_norm!I25","v":true},{"$f":"Norm!J25=Basis_norm!J25","v":true},{"$f":"Norm!K25=Basis_norm!K25","v":true},{"$f":"Norm!L25=Basis_norm!L25","v":true},{"$f":"Norm!M25=Basis_norm!M25","v":true},{"$f":"Norm!N25=Basis_norm!N25","v":true},{"$f":"Norm!O25=Basis_norm!O25","v":true},{"$f":"Norm!P25=Basis_norm!P25","v":true},{"$f":"Norm!Q25=Basis_norm!Q25","v":true},{"$f":"Norm!R25=Basis_norm!R25","v":true},{"$f":"Norm!S25=Basis_norm!S25","v":true},{"$f":"Norm!T25=Basis_norm!T25","v":true},{"$f":"Norm!U25=Basis_norm!U25","v":true},{"$f":"Norm!V25=Basis_norm!V25","v":true},{"$f":"Norm!W25=Basis_norm!W25","v":true},{"$f":"Norm!X25=Basis_norm!X25","v":true},{"$f":"Norm!Y25=Basis_norm!Y25","v":true}]
[null,8,"Frøgræs, udtjent",{"$f":"Norm!D26=Basis_norm!D26","v":true},{"$f":"Norm!E26=Basis_norm!E26","v":true},{"$f":"Norm!F26=Basis_norm!F26","v":true},{"$f":"Norm!G26=Basis_norm!G26","v":true},{"$f":"Norm!H26=Basis_norm!H26","v":true},{"$f":"Norm!I26=Basis_norm!I26","v":true},{"$f":"Norm!J26=Basis_norm!J26","v":true},{"$f":"Norm!K26=Basis_norm!K26","v":true},{"$f":"Norm!L26=Basis_norm!L26","v":true},{"$f":"Norm!M26=Basis_norm!M26","v":true},{"$f":"Norm!N26=Basis_norm!N26","v":true},{"$f":"Norm!O26=Basis_norm!O26","v":true},{"$f":"Norm!P26=Basis_norm!P26","v":true},{"$f":"Norm!Q26=Basis_norm!Q26","v":true},{"$f":"Norm!R26=Basis_norm!R26","v":true},{"$f":"Norm!S26=Basis_norm!S26","v":true},{"$f":"Norm!T26=Basis_norm!T26","v":true},{"$f":"Norm!U26=Basis_norm!U26","v":true},{"$f":"Norm!V26=Basis_norm!V26","v":true},{"$f":"Norm!W26=Basis_norm!W26","v":true},{"$f":"Norm!X26=Basis_norm!X26","v":true},{"$f":"Norm!Y26=Basis_norm!Y26","v":true}]
[null,9,"Gul sennep",{"$f":"Norm!D27=Basis_norm!D27","v":true},{"$f":"Norm!E27=Basis_norm!E27","v":true},{"$f":"Norm!F27=Basis_norm!F27","v":true},{"$f":"Norm!G27=Basis_norm!G27","v":true},{"$f":"Norm!H27=Basis_norm!H27","v":true},{"$f":"Norm!I27=Basis_norm!I27","v":true},{"$f":"Norm!J27=Basis_norm!J27","v":true},{"$f":"Norm!K27=Basis_norm!K27","v":true},{"$f":"Norm!L27=Basis_norm!L27","v":true},{"$f":"Norm!M27=Basis_norm!M27","v":true},{"$f":"Norm!N27=Basis_norm!N27","v":true},{"$f":"Norm!O27=Basis_norm!O27","v":true},{"$f":"Norm!P27=Basis_norm!P27","v":true},{"$f":"Norm!Q27=Basis_norm!Q27","v":true},{"$f":"Norm!R27=Basis_norm!R27","v":true},{"$f":"Norm!S27=Basis_norm!S27","v":true},{"$f":"Norm!T27=Basis_norm!T27","v":true},{"$f":"Norm!U27=Basis_norm!U27","v":true},{"$f":"Norm!V27=Basis_norm!V27","v":true},{"$f":"Norm!W27=Basis_norm!W27","v":true},{"$f":"Norm!X27=Basis_norm!X27","v":true},{"$f":"Norm!Y27=Basis_norm!Y27","v":true}]
[null,10,"Olieræddike",{"$f":"Norm!D28=Basis_norm!D28","v":true},{"$f":"Norm!E28=Basis_norm!E28","v":true},{"$f":"Norm!F28=Basis_norm!F28","v":true},{"$f":"Norm!G28=Basis_norm!G28","v":true},{"$f":"Norm!H28=Basis_norm!H28","v":true},{"$f":"Norm!I28=Basis_norm!I28","v":true},{"$f":"Norm!J28=Basis_norm!J28","v":true},{"$f":"Norm!K28=Basis_norm!K28","v":true},{"$f":"Norm!L28=Basis_norm!L28","v":true},{"$f":"Norm!M28=Basis_norm!M28","v":true},{"$f":"Norm!N28=Basis_norm!N28","v":true},{"$f":"Norm!O28=Basis_norm!O28","v":true},{"$f":"Norm!P28=Basis_norm!P28","v":true},{"$f":"Norm!Q28=Basis_norm!Q28","v":true},{"$f":"Norm!R28=Basis_norm!R28","v":true},{"$f":"Norm!S28=Basis_norm!S28","v":true},{"$f":"Norm!T28=Basis_norm!T28","v":true},{"$f":"Norm!U28=Basis_norm!U28","v":true},{"$f":"Norm!V28=Basis_norm!V28","v":true},{"$f":"Norm!W28=Basis_norm!W28","v":true},{"$f":"Norm!X28=Basis_norm!X28","v":true},{"$f":"Norm!Y28=Basis_norm!Y28","v":true}]
[null,11,"Vinterraps, hybrid",{"$f":"Norm!D29=Basis_norm!D29","v":true},{"$f":"Norm!E29=Basis_norm!E29","v":true},{"$f":"Norm!F29=Basis_norm!F29","v":true},{"$f":"Norm!G29=Basis_norm!G29","v":true},{"$f":"Norm!H29=Basis_norm!H29","v":true},{"$f":"Norm!I29=Basis_norm!I29","v":true},{"$f":"Norm!J29=Basis_norm!J29","v":true},{"$f":"Norm!K29=Basis_norm!K29","v":true},{"$f":"Norm!L29=Basis_norm!L29","v":true},{"$f":"Norm!M29=Basis_norm!M29","v":true},{"$f":"Norm!N29=Basis_norm!N29","v":true},{"$f":"Norm!O29=Basis_norm!O29","v":true},{"$f":"Norm!P29=Basis_norm!P29","v":true},{"$f":"Norm!Q29=Basis_norm!Q29","v":true},{"$f":"Norm!R29=Basis_norm!R29","v":true},{"$f":"Norm!S29=Basis_norm!S29","v":true},{"$f":"Norm!T29=Basis_norm!T29","v":true},{"$f":"Norm!U29=Basis_norm!U29","v":true},{"$f":"Norm!V29=Basis_norm!V29","v":true},{"$f":"Norm!W29=Basis_norm!W29","v":true},{"$f":"Norm!X29=Basis_norm!X29","v":true},{"$f":"Norm!Y29=Basis_norm!Y29","v":true}]
[null,12,"Vinterraps , linie",{"$f":"Norm!D30=Basis_norm!D30","v":true},{"$f":"Norm!E30=Basis_norm!E30","v":true},{"$f":"Norm!F30=Basis_norm!F30","v":true},{"$f":"Norm!G30=Basis_norm!G30","v":true},{"$f":"Norm!H30=Basis_norm!H30","v":true},{"$f":"Norm!I30=Basis_norm!I30","v":true},{"$f":"Norm!J30=Basis_norm!J30","v":true},{"$f":"Norm!K30=Basis_norm!K30","v":true},{"$f":"Norm!L30=Basis_norm!L30","v":true},{"$f":"Norm!M30=Basis_norm!M30","v":true},{"$f":"Norm!N30=Basis_norm!N30","v":true},{"$f":"Norm!O30=Basis_norm!O30","v":true},{"$f":"Norm!P30=Basis_norm!P30","v":true},{"$f":"Norm!Q30=Basis_norm!Q30","v":true},{"$f":"Norm!R30=Basis_norm!R30","v":true},{"$f":"Norm!S30=Basis_norm!S30","v":true},{"$f":"Norm!T30=Basis_norm!T30","v":true},{"$f":"Norm!U30=Basis_norm!U30","v":true},{"$f":"Norm!V30=Basis_norm!V30","v":true},{"$f":"Norm!W30=Basis_norm!W30","v":true},{"$f":"Norm!X30=Basis_norm!X30","v":true},{"$f":"Norm!Y30=Basis_norm!Y30","v":true}]
[null,13,"Foderradise (Strukturator)",{"$f":"Norm!D31=Basis_norm!D31","v":true},{"$f":"Norm!E31=Basis_norm!E31","v":true},{"$f":"Norm!F31=Basis_norm!F31","v":true},{"$f":"Norm!G31=Basis_norm!G31","v":true},{"$f":"Norm!H31=Basis_norm!H31","v":true},{"$f":"Norm!I31=Basis_norm!I31","v":true},{"$f":"Norm!J31=Basis_norm!J31","v":true},{"$f":"Norm!K31=Basis_norm!K31","v":true},{"$f":"Norm!L31=Basis_norm!L31","v":true},{"$f":"Norm!M31=Basis_norm!M31","v":true},{"$f":"Norm!N31=Basis_norm!N31","v":true},{"$f":"Norm!O31=Basis_norm!O31","v":true},{"$f":"Norm!P31=Basis_norm!P31","v":true},{"$f":"Norm!Q31=Basis_norm!Q31","v":true},{"$f":"Norm!R31=Basis_norm!R31","v":true},{"$f":"Norm!S31=Basis_norm!S31","v":true},{"$f":"Norm!T31=Basis_norm!T31","v":true},{"$f":"Norm!U31=Basis_norm!U31","v":true},{"$f":"Norm!V31=Basis_norm!V31","v":true},{"$f":"Norm!W31=Basis_norm!W31","v":true},{"$f":"Norm!X31=Basis_norm!X31","v":true},{"$f":"Norm!Y31=Basis_norm!Y31","v":true}]
[null,14,"Havre, sået inden 1. august",{"$f":"Norm!D32=Basis_norm!D32","v":true},{"$f":"Norm!E32=Basis_norm!E32","v":true},{"$f":"Norm!F32=Basis_norm!F32","v":true},{"$f":"Norm!G32=Basis_norm!G32","v":true},{"$f":"Norm!H32=Basis_norm!H32","v":true},{"$f":"Norm!I32=Basis_norm!I32","v":true},{"$f":"Norm!J32=Basis_norm!J32","v":true},{"$f":"Norm!K32=Basis_norm!K32","v":true},{"$f":"Norm!L32=Basis_norm!L32","v":true},{"$f":"Norm!M32=Basis_norm!M32","v":true},{"$f":"Norm!N32=Basis_norm!N32","v":true},{"$f":"Norm!O32=Basis_norm!O32","v":true},{"$f":"Norm!P32=Basis_norm!P32","v":true},{"$f":"Norm!Q32=Basis_norm!Q32","v":true},{"$f":"Norm!R32=Basis_norm!R32","v":true},{"$f":"Norm!S32=Basis_norm!S32","v":true},{"$f":"Norm!T32=Basis_norm!T32","v":true},{"$f":"Norm!U32=Basis_norm!U32","v":true},{"$f":"Norm!V32=Basis_norm!V32","v":true},{"$f":"Norm!W32=Basis_norm!W32","v":true},{"$f":"Norm!X32=Basis_norm!X32","v":true},{"$f":"Norm!Y32=Basis_norm!Y32","v":true}]
[null,15,"Havre, sået mellem 1. og 20. august",{"$f":"Norm!D33=Basis_norm!D33","v":true},{"$f":"Norm!E33=Basis_norm!E33","v":true},{"$f":"Norm!F33=Basis_norm!F33","v":true},{"$f":"Norm!G33=Basis_norm!G33","v":true},{"$f":"Norm!H33=Basis_norm!H33","v":true},{"$f":"Norm!I33=Basis_norm!I33","v":true},{"$f":"Norm!J33=Basis_norm!J33","v":true},{"$f":"Norm!K33=Basis_norm!K33","v":true},{"$f":"Norm!L33=Basis_norm!L33","v":true},{"$f":"Norm!M33=Basis_norm!M33","v":true},{"$f":"Norm!N33=Basis_norm!N33","v":true},{"$f":"Norm!O33=Basis_norm!O33","v":true},{"$f":"Norm!P33=Basis_norm!P33","v":true},{"$f":"Norm!Q33=Basis_norm!Q33","v":true},{"$f":"Norm!R33=Basis_norm!R33","v":true},{"$f":"Norm!S33=Basis_norm!S33","v":true},{"$f":"Norm!T33=Basis_norm!T33","v":true},{"$f":"Norm!U33=Basis_norm!U33","v":true},{"$f":"Norm!V33=Basis_norm!V33","v":true},{"$f":"Norm!W33=Basis_norm!W33","v":true},{"$f":"Norm!X33=Basis_norm!X33","v":true},{"$f":"Norm!Y33=Basis_norm!Y33","v":true}]
[null,16,"Stauderug, sået inden 1. august",{"$f":"Norm!D34=Basis_norm!D34","v":true},{"$f":"Norm!E34=Basis_norm!E34","v":true},{"$f":"Norm!F34=Basis_norm!F34","v":true},{"$f":"Norm!G34=Basis_norm!G34","v":true},{"$f":"Norm!H34=Basis_norm!H34","v":true},{"$f":"Norm!I34=Basis_norm!I34","v":true},{"$f":"Norm!J34=Basis_norm!J34","v":true},{"$f":"Norm!K34=Basis_norm!K34","v":true},{"$f":"Norm!L34=Basis_norm!L34","v":true},{"$f":"Norm!M34=Basis_norm!M34","v":true},{"$f":"Norm!N34=Basis_norm!N34","v":true},{"$f":"Norm!O34=Basis_norm!O34","v":true},{"$f":"Norm!P34=Basis_norm!P34","v":true},{"$f":"Norm!Q34=Basis_norm!Q34","v":true},{"$f":"Norm!R34=Basis_norm!R34","v":true},{"$f":"Norm!S34=Basis_norm!S34","v":true},{"$f":"Norm!T34=Basis_norm!T34","v":true},{"$f":"Norm!U34=Basis_norm!U34","v":true},{"$f":"Norm!V34=Basis_norm!V34","v":true},{"$f":"Norm!W34=Basis_norm!W34","v":true},{"$f":"Norm!X34=Basis_norm!X34","v":true},{"$f":"Norm!Y34=Basis_norm!Y34","v":true}]
[null,17,"Stauderug, sået mellem 1. og 20. august",{"$f":"Norm!D35=Basis_norm!D35","v":true},{"$f":"Norm!E35=Basis_norm!E35","v":true},{"$f":"Norm!F35=Basis_norm!F35","v":true},{"$f":"Norm!G35=Basis_norm!G35","v":true},{"$f":"Norm!H35=Basis_norm!H35","v":true},{"$f":"Norm!I35=Basis_norm!I35","v":true},{"$f":"Norm!J35=Basis_norm!J35","v":true},{"$f":"Norm!K35=Basis_norm!K35","v":true},{"$f":"Norm!L35=Basis_norm!L35","v":true},{"$f":"Norm!M35=Basis_norm!M35","v":true},{"$f":"Norm!N35=Basis_norm!N35","v":true},{"$f":"Norm!O35=Basis_norm!O35","v":true},{"$f":"Norm!P35=Basis_norm!P35","v":true},{"$f":"Norm!Q35=Basis_norm!Q35","v":true},{"$f":"Norm!R35=Basis_norm!R35","v":true},{"$f":"Norm!S35=Basis_norm!S35","v":true},{"$f":"Norm!T35=Basis_norm!T35","v":true},{"$f":"Norm!U35=Basis_norm!U35","v":true},{"$f":"Norm!V35=Basis_norm!V35","v":true},{"$f":"Norm!W35=Basis_norm!W35","v":true},{"$f":"Norm!X35=Basis_norm!X35","v":true},{"$f":"Norm!Y35=Basis_norm!Y35","v":true}]
[null,18,"Vårbyg, sået inden 1. august",{"$f":"Norm!D36=Basis_norm!D36","v":true},{"$f":"Norm!E36=Basis_norm!E36","v":true},{"$f":"Norm!F36=Basis_norm!F36","v":true},{"$f":"Norm!G36=Basis_norm!G36","v":true},{"$f":"Norm!H36=Basis_norm!H36","v":true},{"$f":"Norm!I36=Basis_norm!I36","v":true},{"$f":"Norm!J36=Basis_norm!J36","v":true},{"$f":"Norm!K36=Basis_norm!K36","v":true},{"$f":"Norm!L36=Basis_norm!L36","v":true},{"$f":"Norm!M36=Basis_norm!M36","v":true},{"$f":"Norm!N36=Basis_norm!N36","v":true},{"$f":"Norm!O36=Basis_norm!O36","v":true},{"$f":"Norm!P36=Basis_norm!P36","v":true},{"$f":"Norm!Q36=Basis_norm!Q36","v":true},{"$f":"Norm!R36=Basis_norm!R36","v":true},{"$f":"Norm!S36=Basis_norm!S36","v":true},{"$f":"Norm!T36=Basis_norm!T36","v":true},{"$f":"Norm!U36=Basis_norm!U36","v":true},{"$f":"Norm!V36=Basis_norm!V36","v":true},{"$f":"Norm!W36=Basis_norm!W36","v":true},{"$f":"Norm!X36=Basis_norm!X36","v":true},{"$f":"Norm!Y36=Basis_norm!Y36","v":true}]
[null,19,"Vårbyg, sået mellem 1. og 20. august",{"$f":"Norm!D37=Basis_norm!D37","v":true},{"$f":"Norm!E37=Basis_norm!E37","v":true},{"$f":"Norm!F37=Basis_norm!F37","v":true},{"$f":"Norm!G37=Basis_norm!G37","v":true},{"$f":"Norm!H37=Basis_norm!H37","v":true},{"$f":"Norm!I37=Basis_norm!I37","v":true},{"$f":"Norm!J37=Basis_norm!J37","v":true},{"$f":"Norm!K37=Basis_norm!K37","v":true},{"$f":"Norm!L37=Basis_norm!L37","v":true},{"$f":"Norm!M37=Basis_norm!M37","v":true},{"$f":"Norm!N37=Basis_norm!N37","v":true},{"$f":"Norm!O37=Basis_norm!O37","v":true},{"$f":"Norm!P37=Basis_norm!P37","v":true},{"$f":"Norm!Q37=Basis_norm!Q37","v":true},{"$f":"Norm!R37=Basis_norm!R37","v":true},{"$f":"Norm!S37=Basis_norm!S37","v":true},{"$f":"Norm!T37=Basis_norm!T37","v":true},{"$f":"Norm!U37=Basis_norm!U37","v":true},{"$f":"Norm!V37=Basis_norm!V37","v":true},{"$f":"Norm!W37=Basis_norm!W37","v":true},{"$f":"Norm!X37=Basis_norm!X37","v":true},{"$f":"Norm!Y37=Basis_norm!Y37","v":true}]
[null,20,"Vinterrug (population), sået inden 1. august",{"$f":"Norm!D38=Basis_norm!D38","v":true},{"$f":"Norm!E38=Basis_norm!E38","v":true},{"$f":"Norm!F38=Basis_norm!F38","v":true},{"$f":"Norm!G38=Basis_norm!G38","v":true},{"$f":"Norm!H38=Basis_norm!H38","v":true},{"$f":"Norm!I38=Basis_norm!I38","v":true},{"$f":"Norm!J38=Basis_norm!J38","v":true},{"$f":"Norm!K38=Basis_norm!K38","v":true},{"$f":"Norm!L38=Basis_norm!L38","v":true},{"$f":"Norm!M38=Basis_norm!M38","v":true},{"$f":"Norm!N38=Basis_norm!N38","v":true},{"$f":"Norm!O38=Basis_norm!O38","v":true},{"$f":"Norm!P38=Basis_norm!P38","v":true},{"$f":"Norm!Q38=Basis_norm!Q38","v":true},{"$f":"Norm!R38=Basis_norm!R38","v":true},{"$f":"Norm!S38=Basis_norm!S38","v":true},{"$f":"Norm!T38=Basis_norm!T38","v":true},{"$f":"Norm!U38=Basis_norm!U38","v":true},{"$f":"Norm!V38=Basis_norm!V38","v":true},{"$f":"Norm!W38=Basis_norm!W38","v":true},{"$f":"Norm!X38=Basis_norm!X38","v":true},{"$f":"Norm!Y38=Basis_norm!Y38","v":true}]
[null,21,"Vinterrug (population), sået inden 20. august",{"$f":"Norm!D39=Basis_norm!D39","v":true},{"$f":"Norm!E39=Basis_norm!E39","v":true},{"$f":"Norm!F39=Basis_norm!F39","v":true},{"$f":"Norm!G39=Basis_norm!G39","v":true},{"$f":"Norm!H39=Basis_norm!H39","v":true},{"$f":"Norm!I39=Basis_norm!I39","v":true},{"$f":"Norm!J39=Basis_norm!J39","v":true},{"$f":"Norm!K39=Basis_norm!K39","v":true},{"$f":"Norm!L39=Basis_norm!L39","v":true},{"$f":"Norm!M39=Basis_norm!M39","v":true},{"$f":"Norm!N39=Basis_norm!N39","v":true},{"$f":"Norm!O39=Basis_norm!O39","v":true},{"$f":"Norm!P39=Basis_norm!P39","v":true},{"$f":"Norm!Q39=Basis_norm!Q39","v":true},{"$f":"Norm!R39=Basis_norm!R39","v":true},{"$f":"Norm!S39=Basis_norm!S39","v":true},{"$f":"Norm!T39=Basis_norm!T39","v":true},{"$f":"Norm!U39=Basis_norm!U39","v":true},{"$f":"Norm!V39=Basis_norm!V39","v":true},{"$f":"Norm!W39=Basis_norm!W39","v":true},{"$f":"Norm!X39=Basis_norm!X39","v":true},{"$f":"Norm!Y39=Basis_norm!Y39","v":true}]
[null,22,"Vinterrug (hybrid og syntetisk), sået inden 1. august",{"$f":"Norm!D40=Basis_norm!D40","v":true},{"$f":"Norm!E40=Basis_norm!E40","v":true},{"$f":"Norm!F40=Basis_norm!F40","v":true},{"$f":"Norm!G40=Basis_norm!G40","v":true},{"$f":"Norm!H40=Basis_norm!H40","v":true},{"$f":"Norm!I40=Basis_norm!I40","v":true},{"$f":"Norm!J40=Basis_norm!J40","v":true},{"$f":"Norm!K40=Basis_norm!K40","v":true},{"$f":"Norm!L40=Basis_norm!L40","v":true},{"$f":"Norm!M40=Basis_norm!M40","v":true},{"$f":"Norm!N40=Basis_norm!N40","v":true},{"$f":"Norm!O40=Basis_norm!O40","v":true},{"$f":"Norm!P40=Basis_norm!P40","v":true},{"$f":"Norm!Q40=Basis_norm!Q40","v":true},{"$f":"Norm!R40=Basis_norm!R40","v":true},{"$f":"Norm!S40=Basis_norm!S40","v":true},{"$f":"Norm!T40=Basis_norm!T40","v":true},{"$f":"Norm!U40=Basis_norm!U40","v":true},{"$f":"Norm!V40=Basis_norm!V40","v":true},{"$f":"Norm!W40=Basis_norm!W40","v":true},{"$f":"Norm!X40=Basis_norm!X40","v":true},{"$f":"Norm!Y40=Basis_norm!Y40","v":true}]
[null,23,"Vinterrug (hybrid og syntetisk), sået inden 20. august",{"$f":"Norm!D41=Basis_norm!D41","v":true},{"$f":"Norm!E41=Basis_norm!E41","v":true},{"$f":"Norm!F41=Basis_norm!F41","v":true},{"$f":"Norm!G41=Basis_norm!G41","v":true},{"$f":"Norm!H41=Basis_norm!H41","v":true},{"$f":"Norm!I41=Basis_norm!I41","v":true},{"$f":"Norm!J41=Basis_norm!J41","v":true},{"$f":"Norm!K41=Basis_norm!K41","v":true},{"$f":"Norm!L41=Basis_norm!L41","v":true},{"$f":"Norm!M41=Basis_norm!M41","v":true},{"$f":"Norm!N41=Basis_norm!N41","v":true},{"$f":"Norm!O41=Basis_norm!O41","v":true},{"$f":"Norm!P41=Basis_norm!P41","v":true},{"$f":"Norm!Q41=Basis_norm!Q41","v":true},{"$f":"Norm!R41=Basis_norm!R41","v":true},{"$f":"Norm!S41=Basis_norm!S41","v":true},{"$f":"Norm!T41=Basis_norm!T41","v":true},{"$f":"Norm!U41=Basis_norm!U41","v":true},{"$f":"Norm!V41=Basis_norm!V41","v":true},{"$f":"Norm!W41=Basis_norm!W41","v":true},{"$f":"Norm!X41=Basis_norm!X41","v":true},{"$f":"Norm!Y41=Basis_norm!Y41","v":true}]
[null,24,"Cikorie",{"$f":"Norm!D42=Basis_norm!D42","v":true},{"$f":"Norm!E42=Basis_norm!E42","v":true},{"$f":"Norm!F42=Basis_norm!F42","v":true},{"$f":"Norm!G42=Basis_norm!G42","v":true},{"$f":"Norm!H42=Basis_norm!H42","v":true},{"$f":"Norm!I42=Basis_norm!I42","v":true},{"$f":"Norm!J42=Basis_norm!J42","v":true},{"$f":"Norm!K42=Basis_norm!K42","v":true},{"$f":"Norm!L42=Basis_norm!L42","v":true},{"$f":"Norm!M42=Basis_norm!M42","v":true},{"$f":"Norm!N42=Basis_norm!N42","v":true},{"$f":"Norm!O42=Basis_norm!O42","v":true},{"$f":"Norm!P42=Basis_norm!P42","v":true},{"$f":"Norm!Q42=Basis_norm!Q42","v":true},{"$f":"Norm!R42=Basis_norm!R42","v":true},{"$f":"Norm!S42=Basis_norm!S42","v":true},{"$f":"Norm!T42=Basis_norm!T42","v":true},{"$f":"Norm!U42=Basis_norm!U42","v":true},{"$f":"Norm!V42=Basis_norm!V42","v":true},{"$f":"Norm!W42=Basis_norm!W42","v":true},{"$f":"Norm!X42=Basis_norm!X42","v":true},{"$f":"Norm!Y42=Basis_norm!Y42","v":true}]
[null,25,"Honningurt",{"$f":"Norm!D43=Basis_norm!D43","v":true},{"$f":"Norm!E43=Basis_norm!E43","v":true},{"$f":"Norm!F43=Basis_norm!F43","v":true},{"$f":"Norm!G43=Basis_norm!G43","v":true},{"$f":"Norm!H43=Basis_norm!H43","v":true},{"$f":"Norm!I43=Basis_norm!I43","v":true},{"$f":"Norm!J43=Basis_norm!J43","v":true},{"$f":"Norm!K43=Basis_norm!K43","v":true},{"$f":"Norm!L43=Basis_norm!L43","v":true},{"$f":"Norm!M43=Basis_norm!M43","v":true},{"$f":"Norm!N43=Basis_norm!N43","v":true},{"$f":"Norm!O43=Basis_norm!O43","v":true},{"$f":"Norm!P43=Basis_norm!P43","v":true},{"$f":"Norm!Q43=Basis_norm!Q43","v":true},{"$f":"Norm!R43=Basis_norm!R43","v":true},{"$f":"Norm!S43=Basis_norm!S43","v":true},{"$f":"Norm!T43=Basis_norm!T43","v":true},{"$f":"Norm!U43=Basis_norm!U43","v":true},{"$f":"Norm!V43=Basis_norm!V43","v":true},{"$f":"Norm!W43=Basis_norm!W43","v":true},{"$f":"Norm!X43=Basis_norm!X43","v":true},{"$f":"Norm!Y43=Basis_norm!Y43","v":true}]
[null,26,"Fodervikke ",{"$f":"Norm!D44=Basis_norm!D44","v":true},{"$f":"Norm!E44=Basis_norm!E44","v":true},{"$f":"Norm!F44=Basis_norm!F44","v":true},{"$f":"Norm!G44=Basis_norm!G44","v":true},{"$f":"Norm!H44=Basis_norm!H44","v":true},{"$f":"Norm!I44=Basis_norm!I44","v":true},{"$f":"Norm!J44=Basis_norm!J44","v":true},{"$f":"Norm!K44=Basis_norm!K44","v":true},{"$f":"Norm!L44=Basis_norm!L44","v":true},{"$f":"Norm!M44=Basis_norm!M44","v":true},{"$f":"Norm!N44=Basis_norm!N44","v":true},{"$f":"Norm!O44=Basis_norm!O44","v":true},{"$f":"Norm!P44=Basis_norm!P44","v":true},{"$f":"Norm!Q44=Basis_norm!Q44","v":true},{"$f":"Norm!R44=Basis_norm!R44","v":true},{"$f":"Norm!S44=Basis_norm!S44","v":true},{"$f":"Norm!T44=Basis_norm!T44","v":true},{"$f":"Norm!U44=Basis_norm!U44","v":true},{"$f":"Norm!V44=Basis_norm!V44","v":true},{"$f":"Norm!W44=Basis_norm!W44","v":true},{"$f":"Norm!X44=Basis_norm!X44","v":true},{"$f":"Norm!Y44=Basis_norm!Y44","v":true}]
[null,27,"Vintervikke",{"$f":"Norm!D45=Basis_norm!D45","v":true},{"$f":"Norm!E45=Basis_norm!E45","v":true},{"$f":"Norm!F45=Basis_norm!F45","v":true},{"$f":"Norm!G45=Basis_norm!G45","v":true},{"$f":"Norm!H45=Basis_norm!H45","v":true},{"$f":"Norm!I45=Basis_norm!I45","v":true},{"$f":"Norm!J45=Basis_norm!J45","v":true},{"$f":"Norm!K45=Basis_norm!K45","v":true},{"$f":"Norm!L45=Basis_norm!L45","v":true},{"$f":"Norm!M45=Basis_norm!M45","v":true},{"$f":"Norm!N45=Basis_norm!N45","v":true},{"$f":"Norm!O45=Basis_norm!O45","v":true},{"$f":"Norm!P45=Basis_norm!P45","v":true},{"$f":"Norm!Q45=Basis_norm!Q45","v":true},{"$f":"Norm!R45=Basis_norm!R45","v":true},{"$f":"Norm!S45=Basis_norm!S45","v":true},{"$f":"Norm!T45=Basis_norm!T45","v":true},{"$f":"Norm!U45=Basis_norm!U45","v":true},{"$f":"Norm!V45=Basis_norm!V45","v":true},{"$f":"Norm!W45=Basis_norm!W45","v":true},{"$f":"Norm!X45=Basis_norm!X45","v":true},{"$f":"Norm!Y45=Basis_norm!Y45","v":true}]
[null,28,"Alexandrinekløver",{"$f":"Norm!D46=Basis_norm!D46","v":true},{"$f":"Norm!E46=Basis_norm!E46","v":true},{"$f":"Norm!F46=Basis_norm!F46","v":true},{"$f":"Norm!G46=Basis_norm!G46","v":true},{"$f":"Norm!H46=Basis_norm!H46","v":true},{"$f":"Norm!I46=Basis_norm!I46","v":true},{"$f":"Norm!J46=Basis_norm!J46","v":true},{"$f":"Norm!K46=Basis_norm!K46","v":true},{"$f":"Norm!L46=Basis_norm!L46","v":true},{"$f":"Norm!M46=Basis_norm!M46","v":true},{"$f":"Norm!N46=Basis_norm!N46","v":true},{"$f":"Norm!O46=Basis_norm!O46","v":true},{"$f":"Norm!P46=Basis_norm!P46","v":true},{"$f":"Norm!Q46=Basis_norm!Q46","v":true},{"$f":"Norm!R46=Basis_norm!R46","v":true},{"$f":"Norm!S46=Basis_norm!S46","v":true},{"$f":"Norm!T46=Basis_norm!T46","v":true},{"$f":"Norm!U46=Basis_norm!U46","v":true},{"$f":"Norm!V46=Basis_norm!V46","v":true},{"$f":"Norm!W46=Basis_norm!W46","v":true},{"$f":"Norm!X46=Basis_norm!X46","v":true},{"$f":"Norm!Y46=Basis_norm!Y46","v":true}]
[null,29,"Hvidkløver",{"$f":"Norm!D47=Basis_norm!D47","v":true},{"$f":"Norm!E47=Basis_norm!E47","v":true},{"$f":"Norm!F47=Basis_norm!F47","v":true},{"$f":"Norm!G47=Basis_norm!G47","v":true},{"$f":"Norm!H47=Basis_norm!H47","v":true},{"$f":"Norm!I47=Basis_norm!I47","v":true},{"$f":"Norm!J47=Basis_norm!J47","v":true},{"$f":"Norm!K47=Basis_norm!K47","v":true},{"$f":"Norm!L47=Basis_norm!L47","v":true},{"$f":"Norm!M47=Basis_norm!M47","v":true},{"$f":"Norm!N47=Basis_norm!N47","v":true},{"$f":"Norm!O47=Basis_norm!O47","v":true},{"$f":"Norm!P47=Basis_norm!P47","v":true},{"$f":"Norm!Q47=Basis_norm!Q47","v":true},{"$f":"Norm!R47=Basis_norm!R47","v":true},{"$f":"Norm!S47=Basis_norm!S47","v":true},{"$f":"Norm!T47=Basis_norm!T47","v":true},{"$f":"Norm!U47=Basis_norm!U47","v":true},{"$f":"Norm!V47=Basis_norm!V47","v":true},{"$f":"Norm!W47=Basis_norm!W47","v":true},{"$f":"Norm!X47=Basis_norm!X47","v":true},{"$f":"Norm!Y47=Basis_norm!Y47","v":true}]
[null,30,"Blanding af olieræddike og fodervikke",{"$f":"Norm!D48=Basis_norm!D48","v":true},{"$f":"Norm!E48=Basis_norm!E48","v":true},{"$f":"Norm!F48=Basis_norm!F48","v":true},{"$f":"Norm!G48=Basis_norm!G48","v":true},{"$f":"Norm!H48=Basis_norm!H48","v":true},{"$f":"Norm!I48=Basis_norm!I48","v":true},{"$f":"Norm!J48=Basis_norm!J48","v":true},{"$f":"Norm!K48=Basis_norm!K48","v":true},{"$f":"Norm!L48=Basis_norm!L48","v":true},{"$f":"Norm!M48=Basis_norm!M48","v":true},{"$f":"Norm!N48=Basis_norm!N48","v":true},{"$f":"Norm!O48=Basis_norm!O48","v":true},{"$f":"Norm!P48=Basis_norm!P48","v":true},{"$f":"Norm!Q48=Basis_norm!Q48","v":true},{"$f":"Norm!R48=Basis_norm!R48","v":true},{"$f":"Norm!S48=Basis_norm!S48","v":true},{"$f":"Norm!T48=Basis_norm!T48","v":true},{"$f":"Norm!U48=Basis_norm!U48","v":true},{"$f":"Norm!V48=Basis_norm!V48","v":true},{"$f":"Norm!W48=Basis_norm!W48","v":true},{"$f":"Norm!X48=Basis_norm!X48","v":true},{"$f":"Norm!Y48=Basis_norm!Y48","v":true}]
[null,31,"Hvidkløver/alm. rajgræs",{"$f":"Norm!D49=Basis_norm!D49","v":true},{"$f":"Norm!E49=Basis_norm!E49","v":true},{"$f":"Norm!F49=Basis_norm!F49","v":true},{"$f":"Norm!G49=Basis_norm!G49","v":true},{"$f":"Norm!H49=Basis_norm!H49","v":true},{"$f":"Norm!I49=Basis_norm!I49","v":true},{"$f":"Norm!J49=Basis_norm!J49","v":true},{"$f":"Norm!K49=Basis_norm!K49","v":true},{"$f":"Norm!L49=Basis_norm!L49","v":true},{"$f":"Norm!M49=Basis_norm!M49","v":true},{"$f":"Norm!N49=Basis_norm!N49","v":true},{"$f":"Norm!O49=Basis_norm!O49","v":true},{"$f":"Norm!P49=Basis_norm!P49","v":true},{"$f":"Norm!Q49=Basis_norm!Q49","v":true},{"$f":"Norm!R49=Basis_norm!R49","v":true},{"$f":"Norm!S49=Basis_norm!S49","v":true},{"$f":"Norm!T49=Basis_norm!T49","v":true},{"$f":"Norm!U49=Basis_norm!U49","v":true},{"$f":"Norm!V49=Basis_norm!V49","v":true},{"$f":"Norm!W49=Basis_norm!W49","v":true},{"$f":"Norm!X49=Basis_norm!X49","v":true},{"$f":"Norm!Y49=Basis_norm!Y49","v":true}]
[null,32,"Rødkløver/strandsvingel",{"$f":"Norm!D50=Basis_norm!D50","v":true},{"$f":"Norm!E50=Basis_norm!E50","v":true},{"$f":"Norm!F50=Basis_norm!F50","v":true},{"$f":"Norm!G50=Basis_norm!G50","v":true},{"$f":"Norm!H50=Basis_norm!H50","v":true},{"$f":"Norm!I50=Basis_norm!I50","v":true},{"$f":"Norm!J50=Basis_norm!J50","v":true},{"$f":"Norm!K50=Basis_norm!K50","v":true},{"$f":"Norm!L50=Basis_norm!L50","v":true},{"$f":"Norm!M50=Basis_norm!M50","v":true},{"$f":"Norm!N50=Basis_norm!N50","v":true},{"$f":"Norm!O50=Basis_norm!O50","v":true},{"$f":"Norm!P50=Basis_norm!P50","v":true},{"$f":"Norm!Q50=Basis_norm!Q50","v":true},{"$f":"Norm!R50=Basis_norm!R50","v":true},{"$f":"Norm!S50=Basis_norm!S50","v":true},{"$f":"Norm!T50=Basis_norm!T50","v":true},{"$f":"Norm!U50=Basis_norm!U50","v":true},{"$f":"Norm!V50=Basis_norm!V50","v":true},{"$f":"Norm!W50=Basis_norm!W50","v":true},{"$f":"Norm!X50=Basis_norm!X50","v":true},{"$f":"Norm!Y50=Basis_norm!Y50","v":true}]
[null,33,"Vintervikke/vinterrug",{"$f":"Norm!D51=Basis_norm!D51","v":true},{"$f":"Norm!E51=Basis_norm!E51","v":true},{"$f":"Norm!F51=Basis_norm!F51","v":true},{"$f":"Norm!G51=Basis_norm!G51","v":true},{"$f":"Norm!H51=Basis_norm!H51","v":true},{"$f":"Norm!I51=Basis_norm!I51","v":true},{"$f":"Norm!J51=Basis_norm!J51","v":true},{"$f":"Norm!K51=Basis_norm!K51","v":true},{"$f":"Norm!L51=Basis_norm!L51","v":true},{"$f":"Norm!M51=Basis_norm!M51","v":true},{"$f":"Norm!N51=Basis_norm!N51","v":true},{"$f":"Norm!O51=Basis_norm!O51","v":true},{"$f":"Norm!P51=Basis_norm!P51","v":true},{"$f":"Norm!Q51=Basis_norm!Q51","v":true},{"$f":"Norm!R51=Basis_norm!R51","v":true},{"$f":"Norm!S51=Basis_norm!S51","v":true},{"$f":"Norm!T51=Basis_norm!T51","v":true},{"$f":"Norm!U51=Basis_norm!U51","v":true},{"$f":"Norm!V51=Basis_norm!V51","v":true},{"$f":"Norm!W51=Basis_norm!W51","v":true},{"$f":"Norm!X51=Basis_norm!X51","v":true},{"$f":"Norm!Y51=Basis_norm!Y51","v":true}]
[null,34,"Kløvergræs",{"$f":"Norm!D52=Basis_norm!D52","v":true},{"$f":"Norm!E52=Basis_norm!E52","v":true},{"$f":"Norm!F52=Basis_norm!F52","v":true},{"$f":"Norm!G52=Basis_norm!G52","v":true},{"$f":"Norm!H52=Basis_norm!H52","v":true},{"$f":"Norm!I52=Basis_norm!I52","v":true},{"$f":"Norm!J52=Basis_norm!J52","v":true},{"$f":"Norm!K52=Basis_norm!K52","v":true},{"$f":"Norm!L52=Basis_norm!L52","v":true},{"$f":"Norm!M52=Basis_norm!M52","v":true},{"$f":"Norm!N52=Basis_norm!N52","v":true},{"$f":"Norm!O52=Basis_norm!O52","v":true},{"$f":"Norm!P52=Basis_norm!P52","v":true},{"$f":"Norm!Q52=Basis_norm!Q52","v":true},{"$f":"Norm!R52=Basis_norm!R52","v":true},{"$f":"Norm!S52=Basis_norm!S52","v":true},{"$f":"Norm!T52=Basis_norm!T52","v":true},{"$f":"Norm!U52=Basis_norm!U52","v":true},{"$f":"Norm!V52=Basis_norm!V52","v":true},{"$f":"Norm!W52=Basis_norm!W52","v":true},{"$f":"Norm!X52=Basis_norm!X52","v":true},{"$f":"Norm!Y52=Basis_norm!Y52","v":true}]
[]
[null,null,null,"Antal i alt","Antal sande"]
[null,null,null,{"$f":"COUNTA(D20:Y53)+COUNTA(D4:D6)+COUNTA(D8)+COUNTA(E4:E6)+COUNTA(D10:D13)","v":759},{"$f":"COUNTIF(D20:Y53,TRUE)+COUNTIF(D4:D6,TRUE)+COUNTIF(D8,TRUE)+COUNTIF(E4:E6,TRUE)+COUNTIF(D10:D13,TRUE)","v":759}]
[null,null,"Norm lig basis norm?",{"$f":"D56=E56","v":true}]

{"sheet":"Version","index":12,"n_rows":5,"n_cols":10,"rows_kept":5,"cut":false,"hidden":true,"merged":[]}
["Version 1.06, 18. januar 2016",null,null,null,"KRP","Anvendelse af egen udsæd ændret så arter hvor detter er ulovligt ikke vises, hvis det vælges at der skal anvendes egen udsæd. Rajgræs og rajgrgræs i blanding med hvidkløver ikke længer anset for brugbare til udlæg sammen med vintersæd",null,null,null,"2016-03-18"]
["Version 1.05, 11. januar 2016",null,null,null,"KRP","Fjernet spmg ang. sædskiftesygdomme i kartofler, Spmg. Ang. kålbrok ændret så kun afgrøder der ikke opformere kålbrok vises, hvis dette betragtes som meget vigtigt, Spmg. Ang. eftervirkning rettet så det går på eftervirkningens størrelse, Priser ændret så der kun vises omkostninger, tilføjet makro der opdatere frontend når der bliver ændret i valgene. ",null,null,null,"2016-01-07"]
["Version 1.04, 7. januar 2016",null,null,null,"HSO","Diverse rettelser",null,null,"Sidst opdateret ","2016-01-07"]
["Version 1.01, 8. december 2015"]
["Version 1.02, 16. december 2015",null,null,null,"ERM","Tilføjet udsædspriser",null,null,"Sidst opdateret ","2015-12-16"]

{"sheet":"Afgrøder i regnearket","index":13,"n_rows":31,"n_cols":1,"rows_kept":31,"cut":false,"hidden":true,"merged":[]}
["Afgrøder"]
["Alm. rajgræs"]
["Ital. rajgræs"]
["Westerwoldisk rajgræs"]
["Strandsvingel"]
["Rødsvingel"]
["Engrapgræs"]
["Hundegræs"]
["Frøgræs, udtjent"]
["Gul sennep"]
["Olieræddike"]
["Vinterraps, hybrid"]
["Vinterraps , linie"]
["Foderradise (Strukturator)"]
["Havre"]
["Stauderug"]
["Vårbyg"]
["Vårbyg"]
["Vinterrug "]
["Vinterrug"]
["Cikorie"]
["Honningurt"]
["Fodervikke "]
["Vintervikke"]
["Alexandrinekløver"]
["Hvidkløver"]
["Blanding af olieræddike og fodervikke"]
["Hvidkløver/alm. rajgræs"]
["Rødkløver/strandsvingel"]
["Vintervikke/vinterrug"]
["Kløvergræs"]

{"sheet":"Anvendte kriterier","index":14,"n_rows":20,"n_cols":3,"rows_kept":20,"cut":false,"hidden":false,"merged":[]}
["Kriterier i regnearket","Karakterer"]
["Pligtig efterafgrøde","0, 1",1]
["Pligtig mellemafgrøde","0, 1",{"$f":"C2+1","v":2}]
["MFO-efterafgrøde i blanding","0, 1",{"$f":"C3+1","v":3}]
["MFO-udlæg","0, 1",4]
["Miljø-efterafgrøder",1,5]
["Frivillige efterafgrøder",1,6]
["Grønne marker (2,3 DE-brug)",1,7]
["Egnet til udlæg efterår i vinterkorn","0, 1, 2, 3",8]
["Egnet til udlæg forår","0, 1, 2, 3",9]
["Egnet til udsåning 2-3 uger før høst","0, 1, 2, 3",10]
["Egnet til udsåning efter tidlig høst (10. august)","0, 1, 2, 3",11]
["Kvælstof-fikserende",0.1,12]
["Stor kvælstofeftervirkning","0, 1, 2, 3",13]
["Hurtig og dyb rodvækst på lerjord","0, 1, 2, 3",14]
["Er afgrøden robust mod ukrudtsmidler?","0, 1, 2, 3",15]
["Der findes sorter, der ikke opformerer kålbrok","0, 1, 2, 3",16]
["Der findes sorter, der er sanerende for roecystenematoder","0, 1, 2, 3",17]
["Vinterfast","0, 1, 2, 3",18]
["Egen udsæd kan anvendes4)","0, 1",19]