{"text_format":"1","workbook":"xlsx","n_sheets":15,"sheets":["Forside","Efterafgrøde beslutningsstøtte","Beslutningstræ","Karaktermatrice","Grundkarakterer","1. Anders","99. Andre efterafgrøder","Lister","Hjælpe beregning","Norm","Basis_norm","Norm lig basisnorm","Version","Afgrøder i regnearket","Anvendte kriterier"],"not_rendered":{"charts":0,"images":4,"macros":1,"external_links":0,"defined_names":18,"comments":2,"pivot_tables":0},"unopened":[],"bounds":{"document_bytes":16777216,"sheet_cells":100000,"rows_first":2000,"rows_last":500,"rows_between":2000,"halvings":0,"cell_chars":16384,"cell_head_chars":4096},"cells_cut":0,"cells_raw":0,"read":"whole","date_system":"1900"}

{"sheet":"Forside","index":0,"n_rows":24,"n_cols":1,"rows_kept":24,"cut":false,"hidden":false,"merged":[]}
[]
[]
["Efterafgrøde beslutnsingsstøtteværktøj"]
[]
["Beslutningsstøtteværktøjet er opdateret i ferbuar 2017. Blandt andet blev der rette en del fejl ang. lovlighed af forskellige afgrøder. "]
["Beslutningsstøtteværktøjet kan for nuværende ikke håndtere de frivlillige efterafgrøder med støtte som bliver en del af landbrugspakkens implementering fra 2017, idet det endelige regelsæt ikke kendes ved værktøjets færdiggørelse."]
{"$rows_left_out":19}
{"sheet":"Efterafgrøde beslutningsstøtte","index":1,"n_rows":62,"n_cols":16,"rows_kept":62,"cut":false,"hidden":false,"merged":[[10,2,15,3],[2,16,21,16],[2,17,21,17],[2,10,21,10],[2,11,21,11],[2,15,21,15],[2,4,21,4],[2,12,21,12],[2,13,21,13],[2,14,21,14],[2,5,21,5],[2,6,21,6],[2,7,21,7],[2,8,21,8],[2,9,21,9]]}
[{"$f":"Version!A1","v":"Version 1.06, 18. januar 2016"}]
["Beslutningsstøtteværktøj til valg af efterafgrøder"]
[null,null,null,null,{"$f":"Beslutningstræ!HA40","v":"Pris"},{"$f":"Beslutningstræ!HB40","v":"Nettoomkostninger"},{"$f":"Beslutningstræ!HC40","v":"Er afgrøden robust mod ukrudtsmidler?"},{"$f":"Beslutningstræ!HD40","v":"Der findes sorter, der ikke opformerer kålbrok"},{"$f":"Beslutningstræ!HE40","v":"Der findes sorter, der er sanerende for roecystenematoder"},{"$f":"Beslutningstræ!HF40","v":"Vinterfast"},{"$f":"Beslutningstræ!HG40","v":"Egen udsæd kan anvendes"},{"$f":"Beslutningstræ!HH40","v":"Hurtig og dyb rodvækst på lerjord"},{"$f":"Beslutningstræ!HI40","v":"Kvælstoffikserende"},{"$f":"Beslutningstræ!HJ40","v":"Stor kvælstof-eftervirkning"},{"$f":"Beslutningstræ!HK40","v":"Pligtig efterafgrøde"},{"$f":"Beslutningstræ!IH40","v":"Vejledning"}]
[]
["Obligatoriske spørgsmål"]
["Skal afgrøden kunne fungere som:"]
{"$rows_left_out":57}
{"sheet":"Beslutningstræ","index":2,"n_rows":128,"n_cols":243,"rows_kept":128,"cut":false,"hidden":true,"merged":[[36,27,36,45]]}
[]
[null,null,null,null,null,null,null,null,null,null,null,null,null,null,null,null,null,null,null,null,null,null,null,null,null,null,null,null,null,null,null,null,null,null,null,null,null,null,null,null,null,null,null,null,null,null,null,null,null,null,null,null,null,null,null,null,null,null,null,null,null,null,null,null,null,null,null,null,null,null,null,null,null,null,null,null,null,null,null,null,null,null,null,null,null,null,null,null,null,null,null,null,null,null,null,null,null,null,null,null,null,null,null,null,null,null,null,null,null,null,null,null,null,null,null,null,null,null,null,null,null,null,null,null,null,null,null,null,null,null,null,null,null,null,null,null,null,null,null,null,null,null,null,null,null,null,null,null,null,null,null,null,null,null,null,null,null,null,null,null,null,null,null,null,null,null,null,null,null,null,null,null,null,null,null,null,null,null,null,null,null,null,null,null,null,null,null,null,null,null,null,null,null,null,null,null,null,null,null,null,null,null,null,null,"Afgrøde",null,"Rækkefølgevægtning",10]
[null,null,null,null,null,null,null,null,null,null,null,null,null,null,null,null,null,null,null,null,null,null,null,null,null,null,null,null,null,null,null,null,null,null,null,null,null,null,null,null,null,null,null,null,null,null,null,null,null,null,null,null,null,null,null,null,null,null,null,null,null,null,null,null,null,null,null,null,null,null,null,null,null,null,null,null,null,null,null,null,null,null,null,null,null,null,null,null,null,null,null,null,null,null,null,null,null,null,null,null,null,null,null,null,null,null,null,null,null,null,null,null,null,null,null,null,null,null,null,null,null,null,null,null,null,null,null,null,null,null,null,null,null,null,null,null,null,null,null,null,null,null,null,null,null,null,null,null,null,null,null,null,null,null,null,null,null,null,null,null,null,null,null,null,null,null,null,null,null,null,null,null,null,null,null,null,null,null,null,null,null,null,null,null,null,null,null,null,null,null,null,null,null,null,null,null,null,null,"1= no ties",null,null,5,null,null,"Tidspunkt",null,"Vægt af udsåningstidspunkt",3]
[null,null,"1. Vintersæd","1. Tidligt udlæg",null,null,null,null,null,null,null,null,null,null,null,null,null,null,null,null,null,null,null,null,null,null,null,null,null,null,null,null,null,null,null,null,null,null,null,null,null,null,null,null,null,null,null,null,null,null,null,null,null,null,null,null,null,null,null,null,null,null,null,null,null,null,null,null,null,null,null,null,null,null,null,null,null,null,null,null,null,null,null,null,null,null,null,null,null,null,null,null,null,null,null,null,null,null,null,null,null,null,null,null,null,null,null,null,null,null,null,null,null,null,null,null,null,null,null,null,null,null,null,null,null,null,null,null,null,null,null,null,null,null,null,null,null,null,null,null,null,null,null,null,null,null,null,null,null,null,null,null,null,null,null,null,null,null,null,null,null,null,null,null,null,null,null,null,null,null,null,null,null,null,null,null,null,null,null,null,null,null,null,null,null,null,null,null,null,null,null,null,null,null,null,"nr.","defa","sys","Check for ties","Break ties","plads","vægt"]
[null,null,"2. Vårsæd","2. Før høst",null,null,null,null,null,null,null,null,null,null,null,null,null,null,null,null,null,null,null,null,null,null,null,null,null,null,null,null,null,null,null,null,null,null,null,null,null,null,null,null,null,null,null,null,null,null,null,null,null,null,null,null,null,null,null,null,null,null,null,null,null,null,null,null,null,null,null,null,null,null,null,null,null,null,null,null,null,null,null,null,null,null,null,null,null,null,null,null,null,null,null,null,null,null,null,null,null,null,null,null,null,null,null,null,null,null,null,null,null,null,null,null,null,null,null,null,null,null,null,null,null,null,null,null,null,null,null,null,null,null,null,null,null,null,null,null,null,null,null,null,null,null,null,null,null,null,null,null,null,null,null,null,null,null,null,null,null,null,null,null,null,null,null,null,null,null,null,null,null,null,null,null,null,null,null,null,null,null,null,null,null,null,null,null,null,null,null,null,null,null,null,1,21,{"$f":"GZ5+GO5/10","v":2.1},{"$f":"COUNTIF(GP$5:GP$26,GP5)","v":1},{"$f":"IF(GQ5>1,GP5+GO5/1000,GP5)","v":2.1},{"$f":"_xlfn.RANK.EQ(GR5,$GR$5:$GR$37,0)","v":1},{"$f":"GP5^$GT$3","v":40.841010000000004},null,null,"Pris",{"$f":"'Efterafgrøde beslutningsstøtte'!B24","v":"Ikke vigtigt"},{"$f":"VLOOKUP(GX5,Standard_karakterer,2,FALSE)","v":0},{"$f":"GY5","v":0}]
[null,null,"3. Majs","3. Efter høst",null,null,null,null,null,null,null,null,null,null,null,null,null,null,null,null,null,null,null,null,null,null,null,null,null,null,null,null,null,null,null,null,null,null,null,null,null,null,null,null,null,null,null,null,null,null,"Middelværdier",null,null,null,null,null,null,null,null,null,null,null,null,null,null,null,null,null,null,null,null,null,null,null,null,null,null,null,null,null,null,null,null,null,null,null,null,null,null,null,null,null,null,null,null,null,null,null,null,null,null,null,null,null,null,null,null,null,null,null,null,null,null,null,null,null,null,null,null,null,null,"Midelværdi kvadrat",null,null,null,null,null,null,null,null,null,null,null,null,null,null,null,null,null,null,null,null,null,null,null,null,null,null,null,null,null,null,null,null,null,null,null,null,null,null,null,null,null,null,null,null,null,null,null,null,null,null,null,null,null,null,null,null,null,null,null,null,null,null,null,null,null,null,null,null,null,null,null,null,null,2,12,1.2,{"$f":"COUNTIF(GP$5:GP$26,GP6)","v":1},{"$f":"IF(GQ6>1,GP6+GO6/1000,GP6)","v":1.2},{"$f":"IF(_xlfn.RANK.EQ(GR6,$GR$5:$GR$37,0)>GS$5,(_xlfn.RANK.EQ(GR6,$GR$5:$GR$37,0)+1),(_xlfn.RANK.EQ(GR6,$GR$5:$GR$37,0)))","v":11},{"$f":"GP6^$GT$3","v":2.4883199999999999},null,null,"Pligtig efterafgrøde",{"$f":"IF('Efterafgrøde beslutningsstøtte'!A$7=GW6,\"Ja\",\"Nej\")","v":"Nej"},{"$f":"IF(GX6=\"Ja\",0,0)","v":0},{"$f":"GY6","v":0}]
{"$rows_left_out":123}
{"sheet":"Karaktermatrice","index":3,"n_rows":73,"n_cols":32,"rows_kept":73,"cut":false,"hidden":true,"merged":[]}
[null,null,null,null,null,null,1,2,3,4,5,6,7,8,9,10,11,12,13,14,15,16,17,18,19,20,21,22,23,24,25]
["Basis valg",null,null,null,null,"Efterafgrøde","Index","Efterafgrøde - karakter","Mellemafgrøde - karakter","MFO i blanding - karakter","MFO udlæg - karakter","Egnet til udlæg efterår i vinterkorn","Egnet til udlæg forår","Egnet til udsåning 2-3 uger før høst","Egnet til udsåning efter tidlig høst (10. august)","Efterafgrøde","Mellemafgrøde","MFO i blanding","MFO i udlæg","MFO total","Opformere ikke kålbrok ","Egen udsæd lovlig?","Default","Sys","Plads","Ok ifht. Kålbrok (Hvis det er valgt at der ikke må opformeres kålbrok vises kun afgrøde hvor der findes ok sorter) ","Ok ifht egen udsæd(hvis det er valg at det skal kunne anvendes?)","Kan etableres på valgt tidspunkt","Er godkendt afgrøde","Med?","Index","Efterafgrøde"]
["Lovkrav","Valg i frontend","Konsekvens",null,null,"Alm. rajgræs, dipl., udlæg",1,{"$f":"Grundkarakterer!H8","v":1},{"$f":"Grundkarakterer!I8","v":0},{"$f":"Grundkarakterer!J8","v":0},{"$f":"Grundkarakterer!K8","v":1},{"$f":"Grundkarakterer!O8","v":0},{"$f":"Grundkarakterer!P8","v":3},{"$f":"Grundkarakterer!Q8","v":1},{"$f":"Grundkarakterer!Q8","v":1},{"$f":"IF(OR($C$4=1,$C$5=1),Grundkarakterer!H8,0)","v":0},{"$f":"IF(C$7=1,Grundkarakterer!I8,0)","v":0},{"$f":"IF(OR(C$5=1,C$6=1),Grundkarakterer!J8,0)","v":0},{"$f":"IF(OR(C$5=1,C$6=1),Grundkarakterer!K8,0)","v":0},{"$f":"SUM(R3:S3)","v":0},{"$f":"Grundkarakterer!W8","v":3},{"$f":"Grundkarakterer!AA8","v":0},34,{"$f":"W3/($G$36+1)+P3+Q3+T3","v":0.97142857142857142},{"$f":"_xlfn.RANK.EQ(X3,X$3:X$36,0)","v":1},{"$f":"IF(AND(U3=0,C$26=1),\"Nej\",\"Ja\")","v":"Ja"},{"$f":"IF(AND(V3=0,C$27=1),\"Nej\",\"Ja\")","v":"Ja"},{"$f":"IF(C$21=1,IF(L3>0,\"Ja\",\"Nej\"),IF(C$22=1,IF(M3>0,\"Ja\",\"Nej\"),IF(C$23=1,IF(N3>0,\"Ja\",\"Nej\"),IF(C$24=1,IF(O3>0,\"Ja\",\"Nej\")))))","v":false},{"$f":"IF( $C$9=0,\"Ja\",IF(X3>=$C$9,\"Ja\",\"Nej\"))","v":"Nej"},{"$f":"IF(AND(AB3=\"Ja\",AC3=\"Ja\",Z3=\"Ja\",AA3=\"Ja\"),\"Ja\",\"Nej\")","v":"Nej"},{"$f":"(IF(MATCH(G3,$Y$3:$Y$36,0)=\"xx\",\"xx\",MATCH(G3,$Y$3:$Y$36,0)))","v":1},{"$f":"INDEX(Grundkarakterer!$B$8:$B$41,AE3)","v":"Alm. rajgræs, dipl., udlæg"}]
["Pligtig efterafgrøde",{"$f":"IF('Efterafgrøde beslutningsstøtte'!A$7=\"Vælg funktion\",\"xx\",IF('Efterafgrøde beslutningsstøtte'!A$7=Karaktermatrice!A4,1,0))","v":"xx"},{"$f":"IF(B4=\"xx\",\"xx\",B4)","v":"xx"},null,null,"Ital. rajgræs, dipl., udlæg",2,{"$f":"Grundkarakterer!H9","v":1},{"$f":"Grundkarakterer!I9","v":0},{"$f":"Grundkarakterer!J9","v":0},{"$f":"Grundkarakterer!K9","v":1},{"$f":"Grundkarakterer!O9","v":0},{"$f":"Grundkarakterer!P9","v":0},{"$f":"Grundkarakterer!Q9","v":1},{"$f":"Grundkarakterer!Q9","v":1},{"$f":"IF(OR($C$4=1,$C$5=1),Grundkarakterer!H9,0)","v":0},{"$f":"IF(C$7=1,Grundkarakterer!I9,0)","v":0},{"$f":"IF(OR(C$5=1,C$6=1),Grundkarakterer!J9,0)","v":0},{"$f":"IF(OR(C$5=1,C$6=1),Grundkarakterer!K9,0)","v":0},{"$f":"SUM(R4:S4)","v":0},{"$f":"Grundkarakterer!W9","v":3},{"$f":"Grundkarakterer!AA9","v":0},33,0.94285714285714284,2,"Ja",{"$f":"IF(AND(V4=0,C$27=1),\"Nej\",\"Ja\")","v":"Ja"},false,"Nej","Nej",2,{"$f":"INDEX(Grundkarakterer!$B$8:$B$41,AE4)","v":"Ital. rajgræs, dipl., udlæg"}]
["Pligtig efterafgrøde og MFO afgrøde",{"$f":"IF('Efterafgrøde beslutningsstøtte'!A$7=\"Vælg funktion\",\"xx\",IF('Efterafgrøde beslutningsstøtte'!A$7=Karaktermatrice!A5,1,0))","v":"xx"},{"$f":"IF(B5=\"xx\",\"xx\",B5)","v":"xx"},null,null,"Westerwoldisk rajgræs",3,{"$f":"Grundkarakterer!H10","v":1},{"$f":"Grundkarakterer!I10","v":0},{"$f":"Grundkarakterer!J10","v":0},{"$f":"Grundkarakterer!K10","v":1},{"$f":"Grundkarakterer!O10","v":0},{"$f":"Grundkarakterer!P10","v":0},{"$f":"Grundkarakterer!Q10","v":0},{"$f":"Grundkarakterer!Q10","v":0},{"$f":"IF(OR($C$4=1,$C$5=1),Grundkarakterer!H10,0)","v":0},{"$f":"IF(C$7=1,Grundkarakterer!I10,0)","v":0},{"$f":"IF(OR(C$5=1,C$6=1),Grundkarakterer!J10,0)","v":0},{"$f":"IF(OR(C$5=1,C$6=1),Grundkarakterer!K10,0)","v":0},0,{"$f":"Grundkarakterer!W10","v":3},{"$f":"Grundkarakterer!AA10","v":0},32,0.91428571428571426,3,"Ja","Ja",false,"Nej","Nej",3,{"$f":"INDEX(Grundkarakterer!$B$8:$B$41,AE5)","v":"Westerwoldisk rajgræs"}]
["Kun MFO afgrøde",{"$f":"IF('Efterafgrøde beslutningsstøtte'!A$7=\"Vælg funktion\",\"xx\",IF('Efterafgrøde beslutningsstøtte'!A$7=Karaktermatrice!A6,1,0))","v":"xx"},{"$f":"IF(B6=\"xx\",\"xx\",B6)","v":"xx"},null,null,"Strandsvingel, udlæg",4,{"$f":"Grundkarakterer!H11","v":1},{"$f":"Grundkarakterer!I11","v":0},{"$f":"Grundkarakterer!J11","v":0},{"$f":"Grundkarakterer!K11","v":1},{"$f":"Grundkarakterer!O11","v":1},{"$f":"Grundkarakterer!P11","v":3},{"$f":"Grundkarakterer!Q11","v":0},{"$f":"Grundkarakterer!Q11","v":0},{"$f":"IF(OR($C$4=1,$C$5=1),Grundkarakterer!H11,0)","v":0},{"$f":"IF(C$7=1,Grundkarakterer!I11,0)","v":0},{"$f":"IF(OR(C$5=1,C$6=1),Grundkarakterer!J11,0)","v":0},{"$f":"IF(OR(C$5=1,C$6=1),Grundkarakterer!K11,0)","v":0},0,{"$f":"Grundkarakterer!W11","v":3},{"$f":"Grundkarakterer!AA11","v":0},31,0.88571428571428568,4,"Ja","Ja",false,"Nej","Nej",4,{"$f":"INDEX(Grundkarakterer!$B$8:$B$41,AE6)","v":"Strandsvingel, udlæg"}]
{"$rows_left_out":68}
{"sheet":"Grundkarakterer","index":4,"n_rows":45,"n_cols":28,"rows_kept":45,"cut":false,"hidden":true,"merged":[]}
["Såtidspunkt",null,"1=sammen med"]
[null,null,"2=før høst"]
[null,null,"3=efter høst"]
[]
[]
[]
{"$rows_left_out":40}
{"sheet":"1. Anders","index":5,"n_rows":65,"n_cols":5,"rows_kept":65,"cut":false,"hidden":true,"merged":[]}
["Return"]
[null,"Dyrkningsvejledning for efterafgrøde Anders"]
[]
[null,null,"I Vintersæd"]
[]
[null,null,null,"Etablering ved tidlig udlæg"]
{"$rows_left_out":60}
{"sheet":"99. Andre efterafgrøder","index":6,"n_rows":65,"n_cols":5,"rows_kept":65,"cut":false,"hidden":true,"merged":[]}
["Return"]
[null,"Dyrkningsvejledning for øvrige efterafgrøde"]
[]
[null,null,"I Vintersæd"]
[]
[null,null,null,"Etablering ved tidlig udlæg"]
{"$rows_left_out":60}
{"sheet":"Lister","index":7,"n_rows":33,"n_cols":17,"rows_kept":33,"cut":false,"hidden":true,"merged":[]}
[]
[]
["Efterafgrødens funktion"]
["Vælg hvad afgrøden skal bruges som",null,null,null,null,"Karakterliste",null,null,null,null,"Basisvalg",null,null,null,null,"Afgrøde"]
["Pligtig efterafgrøde"]
["Pligtig efterafgrøde og MFO afgrøde",null,null,null,null,"Pris","Ikke vigtigt","Vigtigt","Meget vigtigt",null,"Ja","Nej",null,null,null,"Vælg afgrøde"]
{"$rows_left_out":28}
{"sheet":"Hjælpe beregning","index":8,"n_rows":45,"n_cols":29,"rows_kept":45,"cut":false,"hidden":true,"merged":[[9,11,9,15],[9,16,9,26],[9,27,9,28],[9,8,9,10]]}
[]
[]
[null,"Søjle A= Løbenr"]
[null,"I søjle B, =1 så er der forsøgsresultater mv ellers ikke",null,null,"Forsøgsresultat",null,null,"0=findes ikke, 1=der er forsøgsresultater",null,null,"1=Vintersæd"]
[null,"Søjle C - nr. på afgrøden 1-34",null,null,"Afgrøde efter efterafgrøde",null,null,"1=vintersæd, 2=vårsæd"]
[null,"Søjle E - kode for om den afgrøde der følger efter er vår- eller vintersæd",null,null,"Såtidspunkt",null,null,"1=sammen med afgrøde, 2=før høst, 3=efter høst"]
{"$rows_left_out":40}
{"sheet":"Norm","index":9,"n_rows":52,"n_cols":26,"rows_kept":52,"cut":false,"hidden":false,"merged":[[13,3,13,14],[14,3,14,8],[14,9,14,14],[16,19,16,20],[15,3,15,8],[16,3,16,5],[16,6,16,8],[15,23,16,24],[15,21,16,22],[16,15,16,17],[15,9,15,14],[16,9,16,11],[16,12,16,14]]}
[]
[null,null,"Omkostninger såning",null,"Kode"]
[null,null,"Sammen med afgrøden",55,1]
[null,null,"Før høst",75,2]
[null,null,"Efter høst",185,3]
[]
{"$rows_left_out":47}
{"sheet":"Basis_norm","index":10,"n_rows":52,"n_cols":26,"rows_kept":52,"cut":false,"hidden":true,"merged":[[15,23,16,24],[16,3,16,5],[16,6,16,8],[16,9,16,11],[16,12,16,14],[16,15,16,17],[16,19,16,20],[13,3,13,14],[14,9,14,14],[15,3,15,8],[15,9,15,14],[15,21,16,22],[14,3,14,8]]}
[]
[null,null,"Omkostninger såning",null,"Kode"]
[null,null,"Sammen med afgrøden",55,1]
[null,null,"Før høst",75,2]
[null,null,"Efter høst",185,3]
[]
{"$rows_left_out":47}
{"sheet":"Norm lig basisnorm","index":11,"n_rows":57,"n_cols":25,"rows_kept":57,"cut":false,"hidden":true,"merged":[[16,23,17,24],[17,3,17,5],[17,6,17,8],[17,9,17,11],[17,12,17,14],[17,15,17,17],[17,19,17,20],[16,21,17,22],[14,3,14,14],[15,3,15,8],[15,9,15,14],[16,3,16,8],[16,9,16,14]]}
[]
[]
[null,null,"Omkostninger såning",null,"Kode"]
[null,null,"Sammen med afgrøden",{"$f":"Norm!D3=Basis_norm!D3","v":true},{"$f":"Norm!E3=Basis_norm!E3","v":true}]
[null,null,"Før høst",{"$f":"Norm!D4=Basis_norm!D4","v":true},{"$f":"Norm!E4=Basis_norm!E4","v":true}]
[null,null,"Efter høst",{"$f":"Norm!D5=Basis_norm!D5","v":true},{"$f":"Norm!E5=Basis_norm!E5","v":true}]
{"$rows_left_out":52}
{"sheet":"Version","index":12,"n_rows":5,"n_cols":10,"rows_kept":5,"cut":false,"hidden":true,"merged":[]}
["Version 1.06, 18. januar 2016",null,null,null,"KRP","Anvendelse af egen udsæd ændret så arter hvor detter er ulovligt ikke vises, hvis det vælges at der skal anvendes egen udsæd. Rajgræs og rajgrgræs i blanding med hvidkløver ikke længer anset for brugbare til udlæg sammen med vintersæd",null,null,null,"2016-03-18"]
["Version 1.05, 11. januar 2016",null,null,null,"KRP","Fjernet spmg ang. sædskiftesygdomme i kartofler, Spmg. Ang. kålbrok ændret så kun afgrøder der ikke opformere kålbrok vises, hvis dette betragtes som meget vigtigt, Spmg. Ang. eftervirkning rettet så det går på eftervirkningens størrelse, Priser ændret så der kun vises omkostninger, tilføjet makro der opdatere frontend når der bliver ændret i valgene. ",null,null,null,"2016-01-07"]
["Version 1.04, 7. januar 2016",null,null,null,"HSO","Diverse rettelser",null,null,"Sidst opdateret ","2016-01-07"]
["Version 1.01, 8. december 2015"]
["Version 1.02, 16. december 2015",null,null,null,"ERM","Tilføjet udsædspriser",null,null,"Sidst opdateret ","2015-12-16"]

{"sheet":"Afgrøder i regnearket","index":13,"n_rows":31,"n_cols":1,"rows_kept":31,"cut":false,"hidden":true,"merged":[]}
["Afgrøder"]
["Alm. rajgræs"]
["Ital. rajgræs"]
["Westerwoldisk rajgræs"]
["Strandsvingel"]
["Rødsvingel"]
{"$rows_left_out":26}
{"sheet":"Anvendte kriterier","index":14,"n_rows":20,"n_cols":3,"rows_kept":20,"cut":false,"hidden":false,"merged":[]}
["Kriterier i regnearket","Karakterer"]
["Pligtig efterafgrøde","0, 1",1]
["Pligtig mellemafgrøde","0, 1",{"$f":"C2+1","v":2}]
["MFO-efterafgrøde i blanding","0, 1",{"$f":"C3+1","v":3}]
["MFO-udlæg","0, 1",4]
["Miljø-efterafgrøder",1,5]
{"$rows_left_out":14}